prikaz
alternative label: 综述 @zh
alternative label: critica @es
preferred label: review @en
preferred label: revizuire @ro
alternative label: рецензија
alternative label: recension @sv
alternative label: kritički prikaz
type: Concept
preferred label: recenzija
preferred label: 리뷰 @ko
preferred label: synthèse @fr
narrower: рецензија
in scheme: Resource Types
alternative label: granskning @sv
broader: teksti
preferred label: recensão @pt
alternative label: revisão @pt
preferred label: рецензия @ru
alternative label: 綜述 @zh
preferred label: مراجعة @ar
definition: A review of others' published work. [Source: Adapted from https://sparontologies.github.io/fabio/current/fabio.html#d4e5273] @en
alternative label: rassegna @it
alternative label: article de synthèse @fr
preferred label: recensione @it
narrow match: PeerReview
alternative label: crítica @es
alternative label: recensió @ca
alternative label: 評審 @zh
preferred label: recenzió @hu
alternative label: resenha @pt
narrower: приказ књиге
preferred label: レビュー @ja
preferred label: ανασκόπηση @el
narrower: komentar
preferred label: приказ
broad match: Text
preferred label: gözden geçirme @tr
narrow match: D016454
alternative label: 評論 @zh
preferred label: recensión @gl
preferred label: Rezension @de
alternative label: comentari @ca
alternative label: revisió @ca
preferred label: ressenya @ca
preferred label: recenze @cs
preferred label: anmeldelse @da
preferred label: рецензія @uk
alternative label: comentario @es
preferred label: reseña @es
alternative label: 评审 @zh
alternative label: критички приказ
alternative label: bespreking @nl
preferred label: 评论 @zh
alternative label: recenzie @ro
alternative label: recensão crítica @pt
preferred label: arvio @fi

veb-sajt
alternative label: veb-stranica
preferred label: موقع إلكتروني @ar
preferred label: webové sídlo @cs
alternative label: موقع ويب @ar
preferred label: webbsida @sv
preferred label: website @nl
alternative label: internet prezentacija
preferred label: 웹사이트 @ko
alternative label: site @ro
preferred label: вебсайт @ru
definition: A collection of related web pages containing text, images, videos and/or other digital assets that are addressed relative to a common Uniform Resource Locator (URL). A web site is hosted on at least one web server, accessible via a network such as the Internet or a private local area network. [Source: http://purl.org/spar/fabio/WebSite] @en
preferred label: web sitesi @tr
alternative label: 網站 @zh
alternative label: интернет презентација
alternative label: página web @es
alternative label: pàgina web @ca
preferred label: hjemmeside @da
preferred label: sitio web @es
preferred label: weboldal @hu
alternative label: pagine web @it
preferred label: 网站 @zh
preferred label: ウェブサイト @ja
alternative label: portal web @es
alternative label: sítio na internet @pt
preferred label: pagină de internet @ro
alternative label: pagina web @es
alternative label: servidor web @es
preferred label: Webseite @de
alternative label: веб-страница
preferred label: verkkosivusto @fi
alternative label: webpage @en
alternative label: portail web @fr
editorial note: Published @en
alternative label: pagină web @ro
preferred label: sito web @it
preferred label: spletna stran @sl
alternative label: paginas web @es
alternative label: webové stránky @cs
preferred label: lloc web @ca
in scheme: Resource Types
preferred label: sítio web @pt
type: Concept
alternative label: sitios web @es
preferred label: веб-сајт
preferred label: вебсторінка @uk
alternative label: portal @es
alternative label: páginas web @es
preferred label: site web @fr
alternative label: 讨论会 @zh
broader: интерактивна грађа

umetničko delo
in scheme: Resource Types
alternative label: Kunstobjekt @de
alternative label: lucrare artistică @ro
preferred label: konstnärligt arbete @sv
alternative label: umetnina @sl
definition: A work of visual arts and performing arts, including musical works; dramatic works; pantomimes and choreographic works; motion picture and other audiovisual works; pictorial, graphic, sculptural and architectural works. Adapted from Law Insider: https://www.lawinsider.com/dictionary/artistic-works @en
alternative label: umetniška stvaritev @sl
alternative label: opera d'arte @it
type: Concept
preferred label: произведение искусства @ru
preferred label: 芸術作品 @ja
alternative label: œuvre plastique @fr
alternative label: œuvre picturale @fr
preferred label: művészeti alkotás @hu
preferred label: obra artística @ca
preferred label: trabalho artístico @pt
preferred label: sanatsal çalışma @tr
top concept of: Resource Types
alternative label: œuvre d'art @fr
preferred label: 예술작품 @ko
preferred label: materiale artistico @it
preferred label: œuvre artistique @fr
preferred label: уметничко дело
preferred label: umetniško delo @sl
preferred label: 艺术作品 @zh
alternative label: trabajo artístico @es
alternative label: treball artístic @ca
alternative label: oggetto d'arte @it
editorial note: New concept included for upcoming version 4.0 @en
alternative label: künstlerische Arbeit @de
preferred label: activitate artistică @ro
preferred label: artistic work @en
alternative label: художественное произведение @ru
alternative label: umetnički rad
alternative label: criação artística @pt
preferred label: твір мистецтва @uk
preferred label: kunstnerisk værk @da
broad match: CreativeWork
alternative label: уметнички рад
alternative label: traballo artístico @gl
preferred label: Kunstwerk @de
preferred label: عمل فني @ar

protokol istraživanja
preferred label: research protocol @en
preferred label: tutkimussuunnitelma @fi
alternative label: metodología de investigación @es
preferred label: протокол дослідження @uk
preferred label: protocol de recerca @ca
preferred label: بروتوكول البحث @ar
in scheme: Resource Types
type: Concept
preferred label: protocolo de investigación @gl
preferred label: protokol raziskave @sl
alternative label: protocolo de pesquisa @pt
preferred label: onderzoeksprotocol @nl
broader: извештај
alternative label: raziskovalni protokol @sl
definition: The protocol is a detailed plan of the research study including a project summary, project description covering the rationale, objectives, methodology, data management and analysis, ethical considerations, gender issues and references. [Source: Adapted from https://www.who.int/publications/i/item/a-practical-guide-for-health-researchers] @en
preferred label: protocol de cercetare @ro
preferred label: протокол исследования @ru
preferred label: 研究プロトコル @ja
preferred label: protocollo di ricerca @it
preferred label: protocole de recherche @fr
preferred label: 'Forschungsprotokoll' @de
preferred label: kutatási protokoll @hu
preferred label: protocolo de investigação @pt
alternative label: metodologia de recerca @ca
preferred label: forskningsprotokoll @sv
preferred label: протокол истраживања
preferred label: 研究方案 @zh
preferred label: araştırma protokolü @tr
alternative label: metodoloxía de investigación @gl
preferred label: forskningsprotokol @da
preferred label: 연구 프로토콜 @ko
preferred label: ερευνητικό πρωτόκολλο @el
broad match: studyregistration

схема конфигурације
alternative label: design de machetă @ro
preferred label: layoutdesign @sv
definition: Layout-design (topography) means the three-dimensional disposition, however expressed, of the elements of an integrated circuit (at least one of which is an active element) and of some or all of the interconnections of an integrated circuit, or such a three-dimensional disposition prepared for an integrated circuit intended for manufacture [Source: https://www.wipo.int/edocs/lexdocs/laws/en/hk/hk028en.pdf] @en
preferred label: σχεδιασμός διάταξης @el
preferred label: 布图设计 @zh
preferred label: načrt postavitve @sl
preferred label: topoğrafya @tr
broad match: https://ncicb.nci.nih.gov/ncimbrowser/ConceptReport.jsp
preferred label: topografía de circuítos integrados @gl
preferred label: topografia de produtos semicondutores @pt
preferred label: компоновка @ru
alternative label: maquetació @ca
preferred label: topografía de productos semiconductores @es
broader: дизајн
preferred label: 레이아웃 디자인( @ko
preferred label: レイアウト設計 @ja
alternative label: schéma d'implantation @fr
alternative label: 레이아웃 설계 @ko
preferred label: piirikaavio @fi
preferred label: disseny de maqueta @ca
preferred label: layout design @en
in scheme: Resource Types
preferred label: дизайн макета @uk
type: Concept
alternative label: design de aspect @ro
preferred label: schéma de configuration @fr
alternative label: kytkentäkaavio @fi
preferred label: تصميم التخطيط @ar
alternative label: Layoutentwurf @de
preferred label: térbeli elrendezés @hu
preferred label: layout di impianto @it
preferred label: lay-out ontwerp @nl
alternative label: макетирование @ru
preferred label: shema konfiguracije
preferred label: Layout @de

fizički uzorak
preferred label: 物理的サンプル @ja
preferred label: физический образец @ru
preferred label: фізичний зразок @uk
preferred label: physical sample @en
preferred label: fizikai minta @hu
preferred label: fysiskt prov @sv
preferred label: prøve @da
definition: Physical samples include biological specimens, rock or mineral specimens, soil or sediment cores, plants and seeds, water quality samples, archaeological artefacts, or DNA and human tissue samples. Samples may be used in analyses and can be destroyed in this process, whereas specimens are preserved curated objects that can be continuously studied. Source: 23 Things Physical Samples https://eprints.gla.ac.uk/309016/1/309016.pdf @en
preferred label: 实物样本 @zh
preferred label: échantillon @fr
preferred label: عينة مادية @ar
editorial note: New concept included for version 4 of resource types Vocab @en
preferred label: 물리 샘플 @ko
preferred label: физички узорак
top concept of: Resource Types
alternative label: carotte de sondage @fr
preferred label: fiziksel numune @tr
preferred label: amostra física @pt
alternative label: campione fisico @it
preferred label: physische Probe @de
alternative label: prototip @ro
preferred label: esemplare @it
preferred label: mostra física @gl
broad match: PhysicalObject
preferred label: fizični vzorec @sl
alternative label: spécimen @fr
type: Concept
preferred label: mostră @ro
preferred label: muestra física @es
in scheme: Resource Types

теза
preferred label: avhandling @sv
alternative label: rapport de thèse @fr
in scheme: Resource Types
definition: A book authored by a student containing a formal presentations of research outputs submitted for examination in completion of a course of study at an institution of higher education, to fulfil the requirements for an academic degree. Also known as a dissertation. [Source: https://sparontologies.github.io/fabio/current/fabio.html#d4e5748] @en
alternative label: 毕业论文 @zh
type: Concept
preferred label: 학위논문 @ko
preferred label: tesi @it
preferred label: szakdolgozat @hu
preferred label: tez @tr
narrower: докторска дисертација
preferred label: 学位论文 @zh
alternative label: disertacija
preferred label: zaključno delo študija @sl
alternative label: 畢業論文 @zh
preferred label: thèse @fr
alternative label: schriftliche Abschlussarbeit @de
alternative label: дисертација
preferred label: Hochschulschrift @de
narrower: мастер/магистарска теза
preferred label: διατριβή @el
preferred label: tese @gl
preferred label: диссертация @ru
preferred label: тези і дисертації @uk
broader: teksti
preferred label: afhandling @da
preferred label: teza
broad match: Text
preferred label: tesis @es
preferred label: scriptie @nl
alternative label: mémoire de thèse @fr
narrower: diplomski rad
preferred label: أطروحة @ar
preferred label: 学位論文 @ja
alternative label: 學位論文 @zh
preferred label: teză @ro
preferred label: opinnäyte @fi
preferred label: kvalifikační práce @cs
preferred label: thesis @en

извештај о истраживању
preferred label: informe de investigación @gl
alternative label: 科研報告 @zh
preferred label: تقرير بحثي @ar
preferred label: research report @en
alternative label: تقرير البحث @ar
preferred label: výzkumná zpráva @cs
alternative label: reporte científico @es
alternative label: informe de investigacion @es
preferred label: 연구 보고서 @ko
preferred label: rapporto di ricerca @it
alternative label: memoria científica @es
in scheme: Resource Types
preferred label: исследовательский отчет @ru
preferred label: kutatási jelentés @hu
preferred label: forskningsrapport @da
preferred label: rapport de recherche @fr
alternative label: reporte cientifico @es
alternative label: rapport scientifique @fr
broad match: d4e5170
editorial note: Published @en
preferred label: tutkimusraportti @fi
alternative label: 科研报告 @zh
preferred label: onderzoeksrapport @nl
broad match: Report
preferred label: Forschungsbericht @de
preferred label: araştırma raporu @tr
preferred label: ερευνητική έκθεση @el
broad match: D058028
preferred label: raport de cercetare @ro
preferred label: izveštaj o istraživanju
alternative label: 调研报告 @zh
alternative label: reporte de investigación @es
broader: извештај
type: Concept
alternative label: 調研報告 @zh
preferred label: informe de recerca @ca
definition: It is publication that reports on the findings of a research project or alternatively scientific observations on or about a subject. [Source: Adapted from https://en.wikipedia.org/wiki/Research_report] @en
preferred label: relatório de investigação @pt
preferred label: 研究报告 @zh
preferred label: poročilo o rezultatih raziskav @sl
alternative label: memòria científica @ca
alternative label: informe del resultado de una investigación @es
preferred label: informe científico @es
alternative label: informe científic @ca
preferred label: 研究報告書 @ja
preferred label: звіт про дослідження @uk
alternative label: 研究報告 @zh
alternative label: informe cientifico @es

агрегирани подаци
preferred label: بيانات مدمجة @ar
preferred label: 集計データ @ja
alternative label: بيانات تلخيصية @ar
preferred label: geaggregeerde data @nl
preferred label: agregirani podatki @sl
broad match: Dataset
preferred label: aggregierte Daten @de
preferred label: aggregoitu tilastotieto @fi
preferred label: données agrégées @fr
alternative label: združeni podatki @sl
in scheme: Resource Types
preferred label: datos agregados @es
type: Concept
alternative label: izpeljani podatki @sl
preferred label: aggregerade data @sv
broad match: https://vocabs.lter-europe.net/elter_cl/en/page/10016
preferred label: συγκεντρωτικά δεδομένα @el
preferred label: aggregated data @en
preferred label: 聚合数据 @zh
alternative label: date cumulate @ro
preferred label: aggregált adatok @hu
preferred label: dades agregades @ca
preferred label: toplanmış veri @tr
preferred label: 집계 데이터 @ko
preferred label: agregirani podaci
broader: скуп података
preferred label: aggregerede data @da
preferred label: date agregate @ro
preferred label: dados agregados @pt
preferred label: dati aggregati @it
preferred label: агрегированные данные @ru
preferred label: агреговані дані @uk
definition: Statistics that relate to broad classes, groups, or categories. The data are averaged, totaled, or otherwise derived from individual-level data, and it is no longer possible to distinguish the characteristics of individuals within those classes, groups, or categories. For example, the number and age group of the unemployed in specific geographic regions, or national level statistics on the occurrence of specific offences, originally derived from the statistics of individual police districts. [Source: https://ddialliance.org/Specification/DDI-CV/ModeOfCollection_3.0.html] @en

kompilacija podataka
alternative label: kompilirani podaci
preferred label: 汇编数据 @zh
preferred label: kompilerede data @da
preferred label: donnée compilée @fr
definition: Data collected or assembled from multiple, often heterogeneous sources that have one or more reference points in common, and at least one of the sources was originally produced for other purposes. The data are incorporated in a new entity. For example, providing data on the number of universities in the last 150 years using a variety of available sources (e.g. finance documents, official statistics, university registers), combining survey data with information about geographical areas from official statistics (e.g. population density, doctors per capita, etc.), or using RSS to collect blog posts or tweets, etc. [Source: Adapted from https://ddialliance.org/Specification/DDI-CV/ModeOfCollection_3.0.html] @en
preferred label: derlenmiş veri @tr
preferred label: dati compilati @it
preferred label: yhdistetty data @fi
preferred label: compiled data @en
preferred label: kompilierte Daten @de
alternative label: компилирани подаци
preferred label: datos compilados @gl
broader: скуп података
alternative label: kompilerad data @sv
alternative label: afledte data @da
preferred label: dados compilados @pt
preferred label: date compilate @ro
preferred label: 컴파일 데이터 @ko
preferred label: بيانات مجمعة @ar
alternative label: date adunate @ro
preferred label: sestavljeni podatki @sl
preferred label: 編集データ @ja
preferred label: összegyűjtött adatok @hu
broad match: Dataset
preferred label: компилированные данные @ru
type: Concept
preferred label: dades compilades @ca
alternative label: بيانات موحدة @ar
preferred label: компилација података
in scheme: Resource Types
preferred label: компіляція даних @uk
preferred label: gecompileerde data @nl
preferred label: sammanställd data @sv

библиографија
preferred label: Literaturverzeichnis @de
preferred label: bibliografia @pt
in scheme: Resource Types
alternative label: Bibliografie @de
type: Concept
preferred label: bibliographie @fr
preferred label: библиография @ru
preferred label: bibliografi @sv
preferred label: bibliografía @es
preferred label: قائمة مراجع @ar
preferred label: bibliográfia @hu
preferred label: kaynakça @tr
preferred label: bibliografie @ro
preferred label: 書誌 @ja
definition: A list of the books and articles that have been used by someone when writing a particular book or article [Source: https://dictionary.cambridge.org/dictionary/english/bibliography] @en
narrow match: D016417
preferred label: bibliografija
alternative label: přehled literatury @cs
broader: teksti
preferred label: bibliography @en
preferred label: бібліографія @uk
alternative label: bibliyografya @tr
alternative label: 文獻目錄 @zh
related match: d4e2195
preferred label: 서지 @ko
broad match: Text
alternative label: 书目 @zh
preferred label: βιβλιογραφία @el
preferred label: 文献目录 @zh
alternative label: 書目 @zh

скуп података
alternative label: base de datos @es
related match: cod
preferred label: 데이터 세트 @ko
alternative label: série de données @fr
narrower: агрегирани подаци
alternative label: tutkimusdata @fi
narrower: kompilacija podataka
alternative label: dades de recerca @ca
preferred label: dataset @sv
alternative label: 资料组 @zh
narrower: геопросторни подаци
narrower: подаци прикупљени посматрањем
narrower: podaci merenja i ispitivanja
preferred label: datasæt @da
preferred label: conxunto de datos @gl
preferred label: مجموعة بيانات @ar
preferred label: 数据集 @zh
preferred label: データセット @ja
alternative label: base de dados @pt
top concept of: Resource Types
alternative label: 數據集 @zh
preferred label: adatállomány @hu
preferred label: conjuntos de dados @pt
definition: A collection of related facts and data encoded in a defined structure. [Source: Adapted from http://purl.org/spar/fabio/Dataset] @en
alternative label: grup de dades @ca
alternative label: colecție de date @ro
preferred label: jeu de données @fr
alternative label: ensemble de données @fr
preferred label: set de date @ro
alternative label: zbirka podatkov @sl
preferred label: массив данных @ru
alternative label: سلسلة بيانات @ar
narrower: kodirani podaci
narrower: podaci iz kliničkih ispitivanja
narrower: laboratorijske beleške
preferred label: tutkimusaineisto @fi
narrower: анкетни подаци
preferred label: datová sada @cs
narrower: snimljeni podaci
narrow match: cod.html
preferred label: Datensatz @de
alternative label: набор данных @ru
alternative label: 資料組 @zh
alternative label: set di dati @it
narrower: геномски подаци
preferred label: набір даних @uk
narrower: симулациони подаци
in scheme: Resource Types
preferred label: conjunto de datos @es
alternative label: grupo de datos @es
type: Concept
preferred label: σύνολο δεδομένων @el
preferred label: conjunt de dades @ca
preferred label: skup podataka
preferred label: podatkovni nabor @sl
narrower: експериментални подаци
preferred label: veri seti @tr

diplomski rad
preferred label: bachelorscriptie @nl
preferred label: proyecto fin de carrera @es
preferred label: teză de licență @ro
type: Concept
preferred label: 学士論文 @ja
alternative label: πτυχιακή εργασία @el
alternative label: proxecto de fin de carreira @gl
preferred label: treball de fi de grau @ca
preferred label: bachelor thesis @en
preferred label: mémoire de stage @fr
alternative label: diplomska naloga @sl
alternative label: 本科畢業論文 @zh
alternative label: tesis de licenciatura @es
preferred label: дипломски рад
preferred label: diplomsko delo @sl
alternative label: projecte final de carrera @ca
alternative label: trabalho de fim de licenciatura @pt
preferred label: lisans tezi @tr
preferred label: бакалаврська робота @uk
alternative label: rapport de stage @fr
preferred label: traballo de fin de grao @gl
broad match: Thesis
alternative label: 學士學位論文 @zh
preferred label: 学士学位论文 @zh
alternative label: tesina @es
preferred label: trabalho de fim de curso @pt
preferred label: أطروحة بكالوريوس @ar
preferred label: kandidatuppsats @sv
preferred label: kandidaatin tutkielma @fi
broader: теза
definition: A thesis reporting a research project undertaken as part of an undergraduate course of education leading to a bachelor's degree. [Source: https://sparontologies.github.io/fabio/current/fabio.html#d4e2181] @en
alternative label: monografia de fim de curso @pt
alternative label: Abschlussarbeit (Bachelor) @de
alternative label: tesis de bachiller @es
alternative label: monografia de licenciatura @pt
alternative label: bachelor dissertation @en
alternative label: alapszakos szakdolgozat @hu
preferred label: bakalářská práce @cs
alternative label: trabajo de fin de carrera @es
alternative label: 本科毕业论文 @zh
alternative label: trabajo final de grado @es
preferred label: Masterarbeit @de
preferred label: bacheloropgave @da
preferred label: tesi di laurea @it
in scheme: Resource Types
preferred label: бакалаврская диссертация @ru
preferred label: 학사논문 @ko

патентирани софтвер
preferred label: patent de software @ro
preferred label: ソフトウェア特許 @ja
preferred label: патент на програмне забезпечення @uk
preferred label: patente de software @es
preferred label: 软件著作权 @zh
preferred label: software patent @en
preferred label: szoftverszabadalom @hu
preferred label: yazılım patenti @tr
preferred label: ohjelmistopatentti @fi
preferred label: براءة اختراع برمجيات @ar
alternative label: софтверски патент
alternative label: octrooi op software @nl
preferred label: Softwarepatent @de
broad match: d4e4551
broader: patent
preferred label: patent za programsko opremo @sl
in scheme: Resource Types
type: Concept
alternative label: 软件专利 @zh
alternative label: brevet logiciel @fr
preferred label: softwarepatent @nl
preferred label: ευρεσιτεχνία λογισμικού @el
preferred label: 소프트웨어 특허 @ko
preferred label: brevet de logiciel @fr
preferred label: brevetto software @it
preferred label: mjukvarupatent @sv
alternative label: softverski patent
preferred label: patent de programari @ca
definition: In order to obtain a patent, a software invention must not fall under other non-patentable subject matter (for example, abstract ideas or mathematical theories) and has to fulfill the other substantive patentability criteria (for example, novelty, inventive step [non-obviousness] and industrial applicability [usefulness]). [Source: https://www.wipo.int/patents/en/faq_patents.html] @en
preferred label: патент на программное обеспечение @ru
broad match: Software
preferred label: software-patent @da
preferred label: patentirani softver

vidéo
preferred label: vídeo @ca
preferred label: 视频 @zh
alternative label: 動態影像 @zh
preferred label: 録画資料 @ja
preferred label: video
definition: Media that makes use of images (usually "moving"), with or without sound, over a period of playback time. [Source :https://support.contributors.jstor.org/hc/en-us/articles/11971132444439-JSTOR-Content-and-Resource-Types] @en
preferred label: видео
alternative label: 視頻 @zh
alternative label: video zapis
preferred label: 비디오 @ko
editorial note: Published @en
broad match: Movie
alternative label: film @ro
preferred label: Video @de
alternative label: видео запис
in scheme: Resource Types
type: Concept
alternative label: 动态影像 @zh
preferred label: videó @hu
preferred label: فيديو @ar
broad match: MovingImage
broader: pokretne slike
preferred label: відео @uk

anotacija
preferred label: anmærkning @da
alternative label: nota @ca
alternative label: annotazione @it
definition: An annotation in the sense of a legal note is a legally explanatory comment on a decision handed down by a court or arbitral tribunal. [Source: DRIVER info:eu-repo definition] @en
preferred label: açıklama @tr
alternative label: anotación @gl
preferred label: annotation @fr
preferred label: kommentaari @fi
alternative label: реферат @ru
preferred label: تعليق توضيحي @ar
alternative label: zaznamba @sl
alternative label: annotáció @hu
alternative label: glosa @es
preferred label: Urteilsanmerkung @de
alternative label: apontamento @pt
alternative label: beleška
broad match: Text
alternative label: белешка
alternative label: adnotare @ro
preferred label: annotatie @nl
preferred label: anotação @pt
alternative label: opomba @sl
alternative label: nota a un texto de jurisprudencia @es
alternative label: comentario @es
preferred label: commento @it
alternative label: komentar
preferred label: anotació @ca
alternative label: comentário @pt
preferred label: 주석 @ko
alternative label: 註釋 @zh
preferred label: právní komentář rozsudku nebo rozhodnutí @cs
related match: d4e3790
preferred label: 标注 @zh
alternative label: 注释 @zh
alternative label: glossa @ca
preferred label: nota de xurisprudencia @gl
preferred label: annotering @sv
in scheme: Resource Types
type: Concept
preferred label: nota de jurisprudencia @es
preferred label: zaznamek @sl
preferred label: adnotare legală @ro
alternative label: pravno mnenje @sl
preferred label: аннотация @ru
alternative label: dipnot @tr
alternative label: 詮釋 @zh
preferred label: анотација
alternative label: σχόλιο @el
preferred label: анотація @uk
alternative label: 標注 @zh
preferred label: 注釈 @ja
alternative label: коментар
alternative label: Entscheidungsanmerkung @de
alternative label: 诠释 @zh
broader: teksti

知識統合プロトコル
preferred label: 知识综合协议 @zh
alternative label: načrt raziskave @sl
preferred label: protocolo de síntese de conhecimentos @pt
preferred label: 지식통합 프로토콜 @ko
preferred label: protocole de synthèse @fr
preferred label: metodologija raziskave @sl
broader: извештај
type: Concept
definition: In the context of systematic reviews and meta-analyses, a protocol is a document that presents an explicit plan for a systematic review. The protocol details the rationale and a priori methodological and analytical approach of the review. https://www.bmj.com/content/349/bmj.g7647 @en
preferred label: protocolo de síntese do coñecemento @gl
alternative label: plan de síntese do coñecemento @gl
preferred label: szakirodalom áttekintési protokoll @hu
preferred label: protocol de sinteză a cunostințelor @ro
preferred label: bilgi sentezi protokolü @tr
preferred label: πρωτόκολλο σύνθεσης γνώσης @el
preferred label: protocol de síntesi del coneixement @ca
preferred label: systematisk protokol @da
preferred label: knowledge synthesis protocol @en
editorial note: New concept included t be added to upcoming version 4.0 @en
preferred label: protocollo di sintesi @it
preferred label: بروتوكول توليف المعرفة @ar
alternative label: plan de síntesis del conocimiento @es
preferred label: протокол синтезу знань @uk
preferred label: протокол синтеза знаний @ru
alternative label: metodologija sinteze znanja @sl
preferred label: protocolo de síntesis del conocimiento @es
preferred label: prokoll vid systematisk översikt @sv
broad match: http://purl.bioontology.org/ontology/MESH/D000078182
in scheme: Resource Types
preferred label: Wissenssyntheseprotokoll @de
broad match: d4e5605
alternative label: protocol de evaluare a cunostințelor @ro
alternative label: protokol za sintezo znanja @sl

периодична публикација
in scheme: Resource Types
preferred label: periodikum @cs
alternative label: 连续出版刊物 @zh
preferred label: périodique @fr
alternative label: seriale @it
alternative label: publicação seriada @pt
type: Concept
preferred label: serijska publikacija
alternative label: časopis @cs
alternative label: publication périodique @fr
alternative label: publicação em série @pt
alternative label: publicación seriada @es
alternative label: fortlaufendes Sammelwerk @de
alternative label: publication en série @fr
definition: A periodical is a serial publication with its own distinctive title, characterized by a variety of contents and contributors, and issued at regular intervals. (Adapted from ODLIS) [Source: http://www.abc-clio.com/ODLIS/odlis_p.aspx] @en
preferred label: publicação periódica @pt
alternative label: 連續出版刊物 @zh
preferred label: Periodikum @de
preferred label: 期刊 @zh
alternative label: periodika
expires: 2021-03-12
top concept of: Resource Types
alternative label: periódico @pt
preferred label: periodico @it
preferred label: publicació en sèrie @ca
broad match: Text
preferred label: periodical @en
preferred label: 逐次刊行物 @ja
alternative label: серијска публикација
preferred label: publicación periódica @es
preferred label: süreli yayın @tr
alternative label: периодика
alternative label: publicació periòdica @ca
preferred label: periodiek @nl
alternative label: publicacion periodica @es
alternative label: pubblicazione periodica @it
alternative label: 定期刊物 @zh
alternative label: publicacion seriada @es
preferred label: periodična publikacija

докторска дисертација
in scheme: Resource Types
type: Concept
alternative label: 博士學位論文 @zh
preferred label: докторская диссертация @ru
preferred label: tesi di dottorato @it
preferred label: Dissertation @de
preferred label: διδακτορική διατριβή @el
preferred label: 박사논문 @ko
alternative label: 博士研究生畢業論文 @zh
alternative label: rapport de thèse de doctorat @fr
preferred label: 博士論文 @ja
preferred label: 博士学位论文 @zh
preferred label: doktorska disertacija
alternative label: mémoire de thèse de doctorat @fr
alternative label: Habilitationsschrift @de
preferred label: thèse de doctorat @fr
preferred label: doktorafhandling @da
preferred label: tesi doctoral @ca
preferred label: doctoral thesis @en
preferred label: disertační práce @cs
broad match: Thesis
preferred label: докторська дисертація @uk
preferred label: teză de doctorat @ro
alternative label: ph.d.-afhandling @da
preferred label: doktorsavhandling @sv
preferred label: tese de doutoramento @pt
preferred label: اطروحة دكتوراه @ar
alternative label: اطروحة @ar
broader: теза
alternative label: 博士研究生毕业文论 @zh
alternative label: dissertatie @nl
alternative label: doktorsko delo @sl
preferred label: väitöskirja @fi
alternative label: tesis de doctorado @es
definition: A thesis reporting the research undertaken during a period of graduate study leading to a doctoral degree. [Source: https://sparontologies.github.io/fabio/current/fabio.html#d4e3051] @en
preferred label: doktora tezi @tr
preferred label: doktori disszertáció @hu
preferred label: tesis doctoral @es
alternative label: doktorská práce @cs
preferred label: proefschrift @nl

uvodnik
preferred label: editorial @es
alternative label: реч уредника
related match: D016420
preferred label: pääkirjoitus @fi
alternative label: édito @fr
preferred label: szerkesztői cikk @hu
alternative label: presentació @ca
alternative label: artículo de fondo @es
preferred label: Vorwort @de
alternative label: editorial de revista @ca
preferred label: エディトリアル @ja
broader: часопис
preferred label: voorwoord @nl
preferred label: εκδοτικό σημείωμα @el
alternative label: tribuna de opinión @es
preferred label: editoriale @it
definition: A brief essay expressing the opinion or position of the chief editor(s) of a (academic) journal with respect to a current political, social, cultural, or professional issue. [Source: Adapted from ODLIS [Source: http://www.abc-clio.com/ODLIS/odlis_e.aspx ] @en
in scheme: Resource Types
narrow match: D016421
alternative label: 社评 @zh
preferred label: 에디토리얼 @ko
preferred label: уводник
type: Concept
preferred label: redaktionel @da
preferred label: افتتاحية @ar
preferred label: úvodník @cs
alternative label: Leitartikel @de
alternative label: inledande text i tidskrift @sv
preferred label: редакційна стаття @uk
preferred label: éditorial @fr
alternative label: reč urednika
preferred label: редакционная @ru
preferred label: Editoryal @tr
alternative label: 社評 @zh
alternative label: 社論 @zh
preferred label: 社论 @zh

зборник саопштења са конференције
alternative label: llibre de ponències @ca
narrower: saopštenje sa konferencije
alternative label: Tagungsband @de
alternative label: 會刊 @zh
preferred label: πρακτικά συνεδρίου @el
preferred label: atti di congresso @it
alternative label: 会刊 @zh
alternative label: akta kongresa
preferred label: atas de conferência @pt
alternative label: volumele conferinţei @ro
preferred label: وقائع مؤتمر @ar
preferred label: actas de congreso @es
alternative label: atas de congresso @pt
preferred label: konferenssijulkaisu @fi
alternative label: documente din conferinţă @ro
preferred label: actes de congrés @ca
preferred label: actes de conférence @fr
preferred label: матеріали конференції @uk
alternative label: акта конгреса
preferred label: zbornik prispevkov na konferenci @sl
preferred label: материалы конференций @ru
alternative label: зборник радова са конференције
preferred label: konferencehandlinger @da
preferred label: konferensproceeding @sv
preferred label: konferenciakötet @hu
definition: Conference proceedings is the official record of a conference meeting. It is a collection of documents which corresponds to the presentations given at the conference. It may include additional content. [Source: http://www.ieee.org/documents/confprocdefined.pdf ] @en
preferred label: 会議録 @ja
preferred label: lucrarile conferinţei @ro
preferred label: Konfernzschrift @de
broader: konferencijski prilog
alternative label: 會議論文集 @zh
preferred label: 会议论文集 @zh
alternative label: actas de conferência @pt
alternative label: konferenshandlingar @sv
narrower: постер са конференције
alternative label: libro de ponencias @es
alternative label: actas de conferencia @es
preferred label: sborník konference @cs
alternative label: actes de congrès @fr
alternative label: actas de congresso @pt
preferred label: zbornik saopštenja sa konferencije
alternative label: zbornik radova sa konferencije
in scheme: Resource Types
preferred label: conference proceedings @en
alternative label: 컨퍼런스 프로시딩 @ko
type: Concept
preferred label: 학술대회 자료집 @ko
preferred label: konferans bildirileri @tr

индустријски дизајн
preferred label: industrijsko oblikovanje @sl
preferred label: industridesign @sv
preferred label: βιομηχανικό σχέδιο @el
preferred label: diseño industrial @es
broad match: https://ncicb.nci.nih.gov/ncimbrowser/ConceptReport.jsp
alternative label: dessin industriel @fr
preferred label: endüstriyel tasarım @tr
preferred label: промисловий дизайн @uk
preferred label: Industriedesign @de
preferred label: deseño industrial @gl
preferred label: disseny industrial @ca
preferred label: design industrial @ro
preferred label: промышленный дизайн @ru
preferred label: desenho industrial @pt
preferred label: 工業デザイン @ja
broader: дизајн
type: Concept
preferred label: 工业图纸 @zh
preferred label: tuotesuunnnitelma @fi
preferred label: 산업디자인 @ko
in scheme: Resource Types
preferred label: industriel formgivning @da
definition: Industrial designs are applied to a wide variety of industrial products and handicrafts. They refer to the ornamental or aesthetic aspects of a useful article,including compositions of lines or colors or any three-dimensional forms that give a special appearance to a product or handicraft. [Source: https://www.wipo.int/edocs/pubdocs/en/wipo_pub_943_2018.pdf] @en
preferred label: industrieel ontwerp @nl
preferred label: industrijski dizajn
preferred label: ipari formatervezés @hu
preferred label: schema industriale @it
preferred label: تصميم صناعي @ar
preferred label: industrial design @en
preferred label: schéma industriel @fr

рачунарски програм
alternative label: développement informatique @fr
alternative label: softver
preferred label: software @da
alternative label: programa de computador @pt
top concept of: Resource Types
alternative label: 软体 @zh
broad match: Software
alternative label: 軟件 @zh
narrower: izvorni softverski kod
preferred label: szoftver @hu
alternative label: 軟體 @zh
preferred label: programari @ca
alternative label: počítačový program @cs
preferred label: ソフトウェア @ja
preferred label: Software @de
definition: A computer program in source code (text) or compiled form. [Source: http://purl.org/dc/dcmitype/Software] @en
broad match: SoftwareApplication
alternative label: софтвер
alternative label: programa informático @pt
preferred label: программное обеспечение @ru
preferred label: mjukvara @sv
preferred label: ohjelmisto @fi
preferred label: 소프트웨어 @ko
alternative label: برنامج كمبيوتر @ar
type: Concept
alternative label: programma informatico @it
preferred label: programska oprema @sl
preferred label: 软件 @zh
narrower: софтвер за науку
preferred label: yazılım @tr
in scheme: Resource Types
preferred label: برمجيات @ar
preferred label: λογισμικό @el
alternative label: program informatic @ro
alternative label: programme informatique @fr
alternative label: programa informàtic @ca
alternative label: program @ro
alternative label: soft @ro
alternative label: programa informatico @es
preferred label: računarski program
preferred label: logiciel @fr

ostale periodične publikacije
alternative label: ostala periodika
preferred label: altre publicació periòdica @ca
alternative label: altre publicació en sèrie @ca
preferred label: 其他连续出版物 @zh
preferred label: muu kausijulkaisu @fi
preferred label: diğer süreli yayınlar @tr
preferred label: altro periodico @it
alternative label: остала периодика
preferred label: otras publicaciones periódicas @es
alternative label: anders @nl
preferred label: periodieke uitgave @nl
in scheme: Resource Types
type: Concept
definition: A resource type that is not included in existing terms under the top concept "Text". [COAR definition] @en
preferred label: autre périodique @fr
broader: teksti
preferred label: other periodical @en
preferred label: ostale serijske publikacije @sl
preferred label: остале периодичне публикације
preferred label: その他の逐次刊行物 @ja
preferred label: другое периодическое издание @ru

рецензија
alternative label: revisió d'experts @ca
preferred label: مراجعة الأقران @ar
preferred label: revisione tra pari @it
alternative label: collegiale toetsing @nl
preferred label: revisão por pares @pt
type: Concept
preferred label: peerreview @nl
alternative label: revisió entre iguals @ca
alternative label: validation par les pairs @fr
alternative label: revisió per parells @ca
preferred label: fagfællebedømmelse @da
in scheme: Resource Types
preferred label: vertaisarviointi @fi
preferred label: ομότιμη αξιολόγηση @el
definition: An evaluation of scientific, academic, or professional work by others working in the same field. [Source: Adopted from https://schema.datacite.org/meta/kernel-4.4/doc/DataCite-MetadataKernel_v4.4.pdf] @en
alternative label: naučna ili stručna recenzija
preferred label: akran değerlendirmesi @tr
preferred label: peer review @en
preferred label: strokovna ocena @sl
alternative label: hakem değerlendirmesi @tr
preferred label: évaluation par les pairs @fr
preferred label: avaluació d'experts @ca
preferred label: recenzija
preferred label: evaluare inter pares @ro
preferred label: Gutachten @de
preferred label: 同行评议 @zh
preferred label: экспертная оценка @ru
alternative label: sakkunniggranskning @sv
preferred label: refereegranskning @sv
preferred label: 査読 @ja
alternative label: av aliación por expertos @gl
preferred label: szakmai lektorálás @hu
preferred label: revisión por pares @gl
alternative label: научна или стручна рецензија
broader: prikaz
preferred label: рецензування @uk
preferred label: 동료심사 @ko

kodirani podaci
preferred label: datos codificados @gl
preferred label: dades codificades @ca
in scheme: Resource Types
preferred label: koodattu data @fi
alternative label: donnée codée @fr
definition: Qualitative data (textual, video, audio or still-image) originally produced for other purposes into quantitative data (expressed in unit-by-variable matrices) by using coding techniques in accordance with pre-defined categorization schemes. For example, coded party manifesto data like the "European Parliament Election Study 2009, Manifesto Study" (doi:10.4232/1.10204)". [Source: Adapted from https://ddialliance.org/Specification/DDI-CV/ModeOfCollection_3.0.html] @en
preferred label: kódolt adatok @hu
preferred label: kodierte Daten @de
preferred label: кодирани подаци
preferred label: donnée encodée @fr
preferred label: κωδικοποιημένα δεδομένα @el
preferred label: date criptate @ro
preferred label: geëncodeerde data @nl
preferred label: 부호화 데이터 @ko
preferred label: kodede data @da
preferred label: 符号化データ @ja
broader: скуп података
broad match: Dataset
preferred label: dati codificati @it
preferred label: кодовані дані @uk
preferred label: kodlanmış veri @tr
preferred label: 编码数据 @zh
preferred label: kodad data @sv
alternative label: date codificate @ro
preferred label: dados codificados @pt
preferred label: encoded data @en
preferred label: kodirani podatki @sl
preferred label: بيانات مشفرة @ar
type: Concept
preferred label: кодированные данные @ru

симулациони подаци
preferred label: dades de simulacions @ca
preferred label: simulation data @en
preferred label: بيانات محاكاة @ar
preferred label: προσομοιωμένα δεδομένα @el
preferred label: donnée de simulation @fr
alternative label: podaci dobijeni simulacijom
preferred label: dados de simulação @pt
preferred label: simuleringsdata @da
preferred label: simulatiedata @nl
preferred label: Simulationsdaten @de
preferred label: dati di simulazione @it
preferred label: 模拟数据 @zh
preferred label: szimulációs adatok @hu
preferred label: simülasyon verisi @tr
preferred label: дані симуляції @uk
preferred label: simulacijski podatki @sl
preferred label: datos de simulación @gl
preferred label: simulaatiolla tuotettu data @fi
preferred label: シミュレーションデータ @ja
broader: скуп података
alternative label: подаци добијени симулацијом
alternative label: simulatiegegevens @nl
broad match: Dataset
preferred label: date de simulare @ro
definition: Data resulting from modeling or imitative representation of real-world processes, events, or systems, often using computer programs. For example, a program modeling household consumption responses to indirect tax changes; or a dataset on hypothetical patients and their drug exposure, background conditions, and known adverse events. [Source: Adapted from https://ddialliance.org/Specification/DDI-CV/ModeOfCollection_3.0.html] @en
preferred label: simulacioni podaci
in scheme: Resource Types
preferred label: данные моделирования @ru
type: Concept

друге врсте извештаја
preferred label: rapport overig @nl
preferred label: autre type de rapport @fr
definition: Other types of report may include Business Plans Technical Specifications, data management plans, recommendation reports, white papers, annual reports, auditor's reports, workplace reports, census reports, trip reports, progress reports, investigative reports, budget reports, policy reports, demographic reports, credit reports, appraisal reports, inspection reports, military reports, bound reports, etc. [Source: https://en.wikipedia.org/wiki/Report] @en
preferred label: other type of report @en
in scheme: Resource Types
preferred label: その他の報告書 @ja
preferred label: altro tipo di rapporto @it
preferred label: ostale vrste poročil @sl
alternative label: 其它報告 @zh
editorial note: Deprecated @en
type: Concept
alternative label: outro tipo de relatório @pt
preferred label: sonstiger Report @de
preferred label: diğer rapor türü @tr
preferred label: otro tipo de informe @es
alternative label: otro tipo de reporte @es
alternative label: ander type rapport @nl
preferred label: 其他报告 @zh
preferred label: outro relatório @pt
preferred label: jiná zpráva @cs
preferred label: druge vrste izveštaja
alternative label: guideline @en
expires: 2021-03-12
top concept of: Resource Types
preferred label: نوع آخر من التقرير @ar
alternative label: laboratory material @en
preferred label: altre tipus d'informe @ca

neobjavljen poster sa konferencije
preferred label: konferensposter ej i proceeding @sv
preferred label: póster não publicado nas atas da conferência @pt
preferred label: poster de conferinţă nepublicat @ro
preferred label: Konferenzposter nicht im Tagungsband @de
preferred label: posteri erillisjulkaisuna @fi
preferred label: poster @sl
related match: ConferenceProceeding
in scheme: Resource Types
preferred label: 非会议集里的会议海报/会议板报 @zh
preferred label: póster no publicado en actas de congreso @es
alternative label: 未發表在會議論文集中的海報 @zh
preferred label: yayınlanmamış konferans posteri @tr
preferred label: konferenciaköteten kívüli poszter @hu
preferred label: poster non pubblicato in atti di congresso @it
preferred label: pòster de congrés no publicat @ca
preferred label: ملصق مؤتمر ليس ضمن وقائع المؤتمر @ar
preferred label: conference poster not in proceedings @en
preferred label: póster de congreso non publicado nas actas @gl
alternative label: konference poster ikke i konferencehandlinger @da
definition: A display poster, typically containing text with illustrative figures and/or tables, usually reporting research results or proposing hypotheses, submitted for acceptance to and/or presented at a conference, seminar, symposium, workshop or similar event. Use this label when the poster is not published in a proceeding. [Source: http://purl.org/spar/fabio/ConferencePoster] @en
preferred label: konferenční poster nezahrnutý ve sborníku @cs
alternative label: plakat @sl
preferred label: 미게재 학술대회 포스터 @ko
editorial note: Proposed deprecated @en
preferred label: conferentie poster niet in proceedings @nl
preferred label: стендовый доклад не включенный в материалы конференции @ru
preferred label: 会議発表ポスター（会議録未掲載） @ja
preferred label: αφίσα συνεδρίου που δε δημοσιεύτηκε στα πρακτικά @el
alternative label: póster não publicado nas atas do congresso @pt
broader: konferencijski prilog
preferred label: необјављен постер са конференције
preferred label: poster dans une conférence non publié dans les actes @fr
preferred label: konference plakat ikke i konferencehandlinger @da
preferred label: стендова доповідь яка не увійшла до збірника @uk
type: Concept
alternative label: poster de conférence non publié dans les actes @fr

звучни запис
preferred label: geluid @nl
preferred label: sunet @ro
preferred label: so @ca
preferred label: ääni @fi
preferred label: 声音 @zh
preferred label: zvočni zapis @sl
broad match: MediaObject
top concept of: Resource Types
preferred label: Ton @de
preferred label: son @fr
preferred label: zvuk @cs
preferred label: звук @uk
alternative label: document sonore @fr
preferred label: som @pt
alternative label: zvok @sl
editorial note: Published @en
narrower: музичка композиција
alternative label: ملف صوتي / تسجيل صوتي @ar
preferred label: صوت @ar
preferred label: lyd @da
definition: A resource primarily intended to be heard. Examples include a music playback file format, an audio compact disc, and recorded speech or sounds. [Source: http://dublincore.org/documents/dcmi-terms/#dcmitype-Sound] @en
type: Concept
alternative label: 聲音 @zh
preferred label: 소리 @ko
preferred label: sound @en
preferred label: ses @tr
in scheme: Resource Types
preferred label: zvučni zapis
preferred label: 音声・音楽 @ja
alternative label: enregistrement sonore @fr
preferred label: suono @it
preferred label: sonido @es
preferred label: ljud @sv

анкетни подаци
preferred label: undersøgelsesdata @da
preferred label: 調査データ @ja
preferred label: δεδομένα έρευνας @el
preferred label: undersökningsdata @sv
preferred label: haastatteluaineisto @fi
preferred label: datos de enquisa @gl
alternative label: dades topogràfiques @ca
preferred label: بيانات مسحية @ar
preferred label: dati di indagine @it
preferred label: Umfragedaten @de
preferred label: survey data @en
preferred label: 调查数据 @zh
alternative label: date din sondaj @ro
preferred label: anketni podaci
alternative label: survey-aineisto @fi
broad match: Dataset
preferred label: данные опроса @ru
preferred label: datos de encuesta @es
preferred label: 설문조사 데이터 @ko
alternative label: onderzoeksgegevens @nl
in scheme: Resource Types
preferred label: dades d'enquestes @ca
preferred label: dados de inquéritos @pt
definition: Data resulting from a survey, which is defined as an investigation about the characteristics of a given population by means of collecting data from a sample of that population and estimating their characteristics through the systematic use of statistical methodology. Included are censuses, sample surveys, the collection of data from administrative records and derived statistical activities as well as questionnaires. [Source: Adapted from https://stats.oecd.org/glossary/detail.asp?ID=2620] @en
preferred label: anket verisi @tr
preferred label: anketni podatki @sl
type: Concept
preferred label: felmérési adatok @hu
preferred label: donnée d'enquête @fr
alternative label: données de sondage @fr
preferred label: дані опитування @uk
preferred label: onderzoeksdata @nl
preferred label: date de sondaj @ro
broader: скуп података

подаци прикупљени посматрањем
preferred label: datos observacionais @gl
preferred label: dados observacionais @pt
preferred label: παρατηρησιακά δεδομένα @el
narrow match: http://vocabs.lter-europe.net/elter_cl/10018
preferred label: 관측데이터 @ko
alternative label: dades d'observació @ca
preferred label: observational data @en
preferred label: observatiedata @nl
preferred label: opazovalni podatki @sl
preferred label: dades observacionals @ca
preferred label: havaintoaineisto @fi
preferred label: дані спостереження @uk
preferred label: 観測データ @ja
preferred label: megfigyelési adatok @hu
editorial note: Data resulting from observational research, which involves collecting observations as they occur (for example, observing behaviors, events, development of condition or disease, etc.), without attempting to manipulate any of the independent variables. [Source: Adapted from https://ddialliance.org/Specification/DDI-CV/ModeOfCollection_3.0.html] @en
broader: скуп података
preferred label: 观测数据 @zh
preferred label: donnée d'observation @fr
preferred label: observationsdata @sv
alternative label: datos de observación @gl
preferred label: Beobachtungsdaten @de
preferred label: datos observacionales @es
preferred label: dati osservazionali @it
in scheme: Resource Types
preferred label: данные наблюдений @ru
preferred label: gözlemsel veri @tr
preferred label: بيانات رصدية @ar
preferred label: date observaționale @ro
preferred label: podaci prikupljeni posmatranjem
type: Concept
definition: Data resulting from observational research, which involves collecting observations as they occur (for example, observing behaviors, events, development of condition or disease, etc.), without attempting to manipulate any of the independent variables. [Source: Adapted from https://ddialliance.org/Specification/DDI-CV/ModeOfCollection_3.0.html] @en

slika
type: Concept
preferred label: صورة @ar
preferred label: イメージ @ja
preferred label: изображение @ru
alternative label: figura @es
preferred label: imagem @pt
alternative label: fotografie @ro
alternative label: poză @ro
preferred label: зображення @uk
alternative label: 图片 @zh
preferred label: bild @sv
preferred label: image @en
preferred label: görsel @tr
alternative label: 圖片 @zh
preferred label: imaxe @gl
in scheme: Resource Types
preferred label: imagen @es
definition: A visual representation other than text, including all types of moving image and still image. [Source: Adapted from http://purl.org/dc/dcmitype/Image] @en
preferred label: Bild @de
preferred label: kuva @fi
preferred label: εικόνα @el
preferred label: afbeelding @nl
preferred label: immagine @it
preferred label: kép @hu
preferred label: слика
preferred label: obraz @cs
narrow match: StillImage
alternative label: imaj @tr
alternative label: vizuelni prikaz
alternative label: beeldmateriaal @nl
alternative label: 圖像 @zh
broad match: MediaObject
narrower: pokretne slike
preferred label: 이미지 @ko
alternative label: визуелни приказ
preferred label: billede @da
top concept of: Resource Types
alternative label: vizualna upodobitev @sl
narrower: статична слика
preferred label: imatge @ca
preferred label: 图像 @zh
preferred label: imagine @ro
alternative label: 影像 @zh

статична слика
preferred label: صورة ثابتة @ar
in scheme: Resource Types
preferred label: imaxe fixa @gl
preferred label: immagine fissa @it
alternative label: afbeelding @nl
alternative label: 靜止圖像 @zh
preferred label: statična vizualna predstavitev @sl
alternative label: 靜態圖像 @zh
alternative label: stillbild @sv
preferred label: imagen fija @es
preferred label: 정지영상 @ko
preferred label: állókép @hu
preferred label: неподвижное изображение @ru
alternative label: 静止图像 @zh
preferred label: imagem estática @pt
preferred label: still image @en
alternative label: imagine fixă @ro
alternative label: статична визуелна представа
preferred label: 静止画 @ja
alternative label: imagem fixa @pt
preferred label: Einzelbild @de
preferred label: 静态图像 @zh
preferred label: nepohyblivý obraz @cs
preferred label: image fixe @fr
definition: A recorded static visual representation. This class of image includes diagrams, drawings, graphs, graphic designs, plans, photographs and prints. [Source: Adapted from http://purl.org/spar/fabio/StillImage] @en
preferred label: stillbillede @da
broad match: Image
preferred label: still-kuva @fi
broader: slika
alternative label: imatge estàtica @ca
preferred label: imagine statică @ro
alternative label: imagem @pt
preferred label: imatge fixa @ca
preferred label: statična slika
alternative label: statična vizuelna predstava
type: Concept
preferred label: нерухоме зображення @uk
preferred label: stilstaandbeeld @nl
preferred label: hareketsiz görüntü @tr

експериментални подаци
preferred label: date experimentale @ro
in scheme: Resource Types
preferred label: kokeellinen data @fi
preferred label: kísérleti adatok @hu
preferred label: 실험 데이터 @ko
preferred label: datos experimentales @es
preferred label: eksperimentalni podatki @sl
preferred label: dati sperimentali @it
preferred label: dados experimentais @pt
preferred label: 实验数据 @zh
preferred label: بيانات تجريبية @ar
preferred label: experimentele data @nl
preferred label: donnée expérimentale @fr
preferred label: deneysel veri @tr
preferred label: experimentella data @sv
preferred label: datos experimentais @gl
preferred label: 実験データ @ja
definition: Data resulting from the experimental research method involving the manipulation of some or all of the independent variables included in the hypotheses. [Source: Adapted from https://ddialliance.org/Specification/DDI-CV/ModeOfCollection_3.0.html] @en
preferred label: experimentelle Daten @de
preferred label: experimental data @en
preferred label: eksperimentelle data @da
preferred label: πειραματικά δεδομένα @el
broader: скуп података
preferred label: dades experimentals @ca
broad match: Dataset
preferred label: eksperimentalni podaci
preferred label: експериментальні дані @uk
preferred label: экспериментальные данные @ru
type: Concept

memorandum
preferred label: меморандум
alternative label: comunicación @es
preferred label: memoràndum @ca
alternative label: Denkschrift @de
preferred label: mémo @fr
preferred label: مذكرة @ar
alternative label: comunicado @pt
alternative label: circular @es
preferred label: memorándum @es
preferred label: notat @da
preferred label: emlékeztető @hu
preferred label: メモランダム @ja
alternative label: memòria @ca
preferred label: memorando @pt
alternative label: razprava @sl
editorial note: Published @en
preferred label: muistio @fi
preferred label: Memorandum @de
preferred label: bilgi notu @tr
definition: A formal note distributed internally to one or more persons in a company, agency, organization, or institution, with a header indicating the date it was sent and stating to whom it is addressed (To:), from whom it is sent (From:), and the subject of the text (Re:). Unlike a letter, a memo does not require a full salutation or signature at the end of the text--the sender may simply initial his or her name in the header. [Source: https://products.abc-clio.com/ODLIS/odlis_m.aspx#memorandum] @en
type: Concept
in scheme: Resource Types
preferred label: 备忘录 @zh
preferred label: μνημόνιο @el
alternative label: 備忘錄 @zh
broader: извештај

писмо уреднику
preferred label: brev til redaktøren @da
preferred label: letter to the editor @en
type: Concept
alternative label: carta al editor @es
alternative label: inledande text i tidskrift @sv
in scheme: Resource Types
alternative label: 讀者來信 @zh
alternative label: 快报 @zh
preferred label: pismo uredniku
preferred label: ingezonden brief @nl
preferred label: carta ao editor @pt
preferred label: лист до редакції @uk
preferred label: scrisoare către editor @ro
broad match: d4e3803
alternative label: писмо уредништву
preferred label: 读者来信 @zh
preferred label: رسالة الى المحرر @ar
preferred label: carta al director @es
alternative label: boletin @fr
alternative label: folleto @es
alternative label: comunicazione in rivista @it
alternative label: gacetilla @es
alternative label: pismo uredništvu
alternative label: boletín @fr
preferred label: 来信 @ja
broader: часопис
preferred label: επιστολή προς τον εκδότη @el
preferred label: Leserbrief @de
preferred label: editöre mektup @tr
preferred label: письмо редактору @ru
preferred label: lettera al direttore @it
preferred label: kirje päätoimittajalle @fi
preferred label: lettre à l'éditeur @fr
alternative label: carta al director de revista @es
alternative label: 快報 @zh
preferred label: carta ao director @gl
definition: A letter addressed to the editor and comments on or discussed an item previously published by that periodical, or of interest to its readership. [Source: Adapted from hhttps://sparontologies.github.io/fabio/current/fabio.html#d4e3803] @en
preferred label: dopis redakci @cs
alternative label: pismo redakciji
preferred label: 편집자에게 보내는 편지 @ko
alternative label: писмо редакцији
alternative label: carta al editor de revista @es
alternative label: gaceta @es
preferred label: levél a szerkesztőnek @hu
alternative label: carta ao diretor @pt

остало
alternative label: altele @ro
preferred label: other @en
preferred label: muu @fi
preferred label: ostalo
in scheme: Resource Types
alternative label: غير ذلك @ar
preferred label: anders @nl
preferred label: outros @gl
type: Concept
preferred label: otros @es
preferred label: egyéb @hu
alternative label: altul @ro
preferred label: інше @uk
preferred label: ostatní @cs
preferred label: آخر @ar
alternative label: άλλα @el
preferred label: altro @it
preferred label: autre @fr
preferred label: alte @ro
preferred label: diğer @tr
preferred label: andre @da
top concept of: Resource Types
preferred label: sonstige @de
preferred label: άλλο @el
preferred label: övrigt @sv
definition: A resource type that is not included in existing terms. [COAR definition] @en
preferred label: 其他 @zh
preferred label: altres @ca
alternative label: 其它 @zh
preferred label: 기타 @ko
preferred label: другое @ru
preferred label: その他 @ja

patent
narrower: патент за дизајн
alternative label: patente de invencion @es
top concept of: Resource Types
broad match: Text
definition: A set of exclusive rights granted by law to applicants for inventions that are new, non-obvious and commercially applicable. A patent is valid for a limited period (generally 20 years), during which time patent holders can commercially exploit their inventions on an exclusive basis. [Source: https://www.wipo.int/edocs/pubdocs/en/wipo_pub_943_2018.pdf] @en
preferred label: 특허 @ko
preferred label: براءة اختراع @ar
preferred label: szabadalom @hu
narrower: патентирани софтвер
definition: A patent or patent application. @en
alternative label: patente de invención @es
narrower: patentirana sorta
alternative label: Patentanmeldung @de
preferred label: ευρεσιτεχνία @el
preferred label: brevetto @it
alternative label: patents @en
preferred label: patentti @fi
in scheme: Resource Types
preferred label: патент
type: Concept
alternative label: 專利 @zh
preferred label: patente @pt
preferred label: 特許 @ja
narrower: заштићена биљна сорта
narrower: mali patent
narrower: patentna prijava
preferred label: brevet @ro
preferred label: Patent @de
preferred label: 专利 @zh

interni izveštaj
type: Concept
preferred label: interní zpráva @cs
preferred label: relatório interno @pt
preferred label: informe interno @es
preferred label: informe intern @ca
alternative label: reporte de uso interno @es
editorial note: Deprecated @en
definition: An internal report is a record of findings collected for internal use. It is not designed to be made public and may include confidential or proprietary information. @en
preferred label: interno poročilo @sl
preferred label: rapporto interno @it
preferred label: 内部报告 @zh
preferred label: dahili rapor @tr
expires: 2021-03-12
top concept of: Resource Types
alternative label: notranje poročilo @sl
preferred label: internal report @en
preferred label: interner Bericht @de
preferred label: تقرير داخلي @ar
preferred label: rapport interne @fr
preferred label: интерни извештај
alternative label: 內部報告 @zh
preferred label: 内部報告書 @ja
preferred label: intern rapport @nl
in scheme: Resource Types

tehnički izveštaj
type: Concept
preferred label: raport tehnic @ro
preferred label: технічний звіт @uk
preferred label: tekninen raportti @fi
preferred label: تقرير فني @ar
preferred label: 技术报告 @zh
alternative label: reporte tecnico @es
preferred label: technická zpráva @cs
definition: A document that describes the process, progress, or results of technical or scientific research or the state of a technical or scientific research problem. It might also include recommendations and conclusions of the research. [Source: http://guides.library.cornell.edu/ecommons/types] @en
preferred label: технички извештај
preferred label: informe técnico @es
alternative label: تقرير تقني @ar
preferred label: relatório técnico @pt
preferred label: műszaki jelentés @hu
preferred label: rapport technique @fr
preferred label: teknik rapor @tr
preferred label: tehnično poročilo @sl
preferred label: τεχνική έκθεση @el
preferred label: テクニカルレポート @ja
preferred label: teknisk rapport @da
preferred label: 기술 보고서 @ko
preferred label: technischer Bericht @de
preferred label: informe tècnic @ca
preferred label: technisch rapport @nl
preferred label: rapporto tecnico @it
preferred label: technical report @en
alternative label: reporte técnico @es
preferred label: технический отчет @ru
editorial note: Published @en
in scheme: Resource Types
alternative label: 技術報告 @zh
alternative label: informe tecnico @es
broader: извештај

laboratorijske beleške
preferred label: лабораторні нотатки @uk
preferred label: caderno de laboratorio @gl
alternative label: quadern de laboratori @ca
preferred label: laboratorienotesbog @da
preferred label: ملاحظات مختبرية @ar
alternative label: laboratorijski zvezek @sl
preferred label: llibreta de laboratori @ca
alternative label: labbjournal @sv
preferred label: laborationsjournal @sv
preferred label: carnet de laboratoire @fr
preferred label: caderno de laboratório @pt
in scheme: Resource Types
preferred label: εργαστηριακό τετράδιο @el
preferred label: Laborjournal @de
type: Concept
preferred label: 实验室记录本 @zh
alternative label: cuaderno electrónico de laboratorio @es
preferred label: cuaderno de laboratorio @es
preferred label: лабораторијске белешке
preferred label: laboratoriopäiväkirja @fi
preferred label: laboratorium-notitieboek @nl
alternative label: quadern de camp @ca
alternative label: cahier de laboratoire @fr
preferred label: caiet de laborator @ro
definition: A laboratory notebook (colloq. lab notebook or lab book) is a primary record of research. Researchers use a lab notebook to document their hypotheses, experiments and initial analysis or interpretation of these experiments. This label is used both for traditional and electronic laboratory notebook. [Source: Adapted from https://en.wikipedia.org/wiki/Lab_notebook] @en
alternative label: laboratorijski zapis @sl
preferred label: 実験ノート @ja
preferred label: laboratuvar notları @tr
preferred label: laboratory notebook @en
preferred label: laboratóriumi jegyzetfüzet @hu
broader: скуп података
narrow match: ComputationalNotebook
preferred label: 연구 노트 @ko
preferred label: лабораторный блокнот @ru
preferred label: laboratorijska beležka @sl
preferred label: quaderno di laboratorio @it

notni zapis
editorial note: Published @en
preferred label: notație muzicală @ro
preferred label: ноти @uk
alternative label: music notation @en
alternative label: notenschrift @nl
alternative label: partitura @pt
broad match: d4e4227
preferred label: musikalsk notation @da
preferred label: notació musical @ca
preferred label: нотная запись @ru
alternative label: notacion musical @es
alternative label: 樂譜 @zh
preferred label: muzieknotatie @nl
definition: Symbols used to write music, as in a music score, and to express mathematical concepts. [Source: Adapted from https://products.abc-clio.com/ODLIS/odlis_n.aspx] @en
preferred label: note @sl
alternative label: partition musicale @fr
type: Concept
alternative label: مدونة موسيقية @ar
preferred label: تدوينة موسيقية @ar
preferred label: nuottikirjoitus @fi
alternative label: partition de musique @fr
in scheme: Resource Types
broader: teksti
preferred label: hudební zápis @cs
preferred label: 乐谱 @zh
preferred label: notación musical @gl
preferred label: notazione musicale @it
preferred label: partition @fr
preferred label: 楽譜 @ja
preferred label: μουσική σημειογραφία @el
preferred label: notação musical @pt
alternative label: musikalier @sv
alternative label: Notenschrift @de
alternative label: noty @cs
preferred label: musiknotation @sv
preferred label: nota @tr
alternative label: notskrift @sv
preferred label: нотни запис
preferred label: Musiknotation @de
preferred label: musical notation @en
preferred label: kotta @hu

predavanje
alternative label: lectures @en
preferred label: előadás átirata @hu
preferred label: přednáška @cs
alternative label: discurs @ro
alternative label: conferencia académica @es
alternative label: classe magistral @ca
preferred label: Vorlesung @de
preferred label: relatorio @gl
broader: teksti
preferred label: лекція @uk
alternative label: disertacion @es
preferred label: foredrag @da
alternative label: preleção @pt
preferred label: 강연 @ko
preferred label: 講演 @ja
alternative label: 講座 @zh
narrow match: d4e3776
preferred label: lezione @it
alternative label: lição @pt
alternative label: 讲课 @zh
preferred label: föreläsning @sv
alternative label: charla magistral @es
alternative label: 講課 @zh
alternative label: conferencia @es
alternative label: 演讲 @zh
alternative label: conferinţă @ro
preferred label: διάλεξη @el
preferred label: luento @fi
alternative label: lecție @ro
alternative label: conferência @pt
alternative label: conferencia academica @es
preferred label: lecture @en
alternative label: prelecção @pt
preferred label: prelegere @ro
alternative label: enseignement magistral @fr
preferred label: ders @tr
alternative label: curs @ro
in scheme: Resource Types
type: Concept
preferred label: محاضرة @ar
preferred label: предавање
alternative label: 演講 @zh
preferred label: 讲座 @zh
preferred label: conferència acadèmica @ca
alternative label: conferencia magistral @es
preferred label: ponencia @es
alternative label: disertación @es
preferred label: лекция @ru
definition: Transcription of an oral presentation/talk intended to present information or teach people about a particular subject, for example by a university or college teacher. [Source: Adopted from https://en.wikipedia.org/wiki/Lecture] @en
preferred label: palestra @pt
preferred label: cours magistral @fr

teksti
definition: A resource consisting primarily of words for reading. Examples include books, letters, dissertations, poems, newspapers, articles, archives of mailing lists. Note that facsimiles or images of texts are still of the genre Text. [Source: http://purl.org/dc/dcmitype/Text] @en
narrower: pismo
narrower: predavanje
narrower: transkript
narrower: часопис
preferred label: texto @gl
type: Concept
narrower: prikaz
narrower: радни документ
preferred label: κείμενο @el
preferred label: text @sv
in scheme: Resource Types
narrower: теза
narrower: konferencijski prilog
preferred label: tekst
narrower: књига
preferred label: szöveg @hu
preferred label: 文本 @zh
alternative label: 文檔 @zh
preferred label: testo @it
narrower: predlog istraživačkog projekta
narrower: библиографија
narrower: preprint
preferred label: texte @fr
preferred label: metin @tr
preferred label: Text @de
narrower: novine
narrower: извештај
narrower: tekst na blogu
preferred label: текст
preferred label: besedilo @sl
top concept of: Resource Types
narrower: tehnička dokumentacija
narrower: informativna revija
preferred label: 텍스트 @ko
narrower: anotacija
alternative label: 文档 @zh
narrower: rukopis
preferred label: نص @ar
narrower: ostale periodične publikacije
narrower: notni zapis
preferred label: テキスト @ja
editorial note: Published @en

поглавље у књизи
preferred label: chapitre d'ouvrage @fr
preferred label: bokkapitel @sv
alternative label: chapitre de livre @fr
alternative label: sestavek v knjigi @sl
alternative label: capítulo @pt
preferred label: capitol de carte @ro
alternative label: parte de libro @es
preferred label: capitolo di libro @it
preferred label: kitap bölümü @tr
preferred label: Teil eines Buches @de
preferred label: capítulo de libro @gl
preferred label: capítol de llibre @ca
alternative label: partie d'ouvrage @fr
broad match: Book
alternative label: bog kapitel @da
alternative label: parte de um livro @pt
preferred label: kirjan osa @fi
preferred label: poglavje v knjigi @sl
preferred label: часть книги @ru
alternative label: فصل من كتاب @ar
alternative label: paragrafo @it
alternative label: capitulo de libro @es
preferred label: μέρος του βιβλίου @el
preferred label: bogsektion @da
alternative label: part de llibre @ca
preferred label: جزء من كتاب @ar
alternative label: поглавље у монографији
broader: књига
preferred label: розділ книги @uk
alternative label: kapitola v knize @cs
preferred label: capítulo de livro @pt
in scheme: Resource Types
preferred label: 章节 @zh
alternative label: Buchkapitel @de
alternative label: 章節 @zh
preferred label: könyvrészlet @hu
preferred label: 도서(부분) @ko
preferred label: poglavlje u knjizi
preferred label: část knihy @cs
preferred label: 図書（部分） @ja
preferred label: boekdeel @nl
preferred label: book part @en
type: Concept
definition: A defined chapter or section of a book, usually with a separate title or number. [Source: http://purl.org/spar/fabio/BookChapter] @en
alternative label: poglavlje u monografiji

saopštenje sa konferencije
alternative label: 會議文章 @zh
preferred label: comunicazione a congresso @it
alternative label: comunicação @pt
alternative label: presentació de congrés @ca
alternative label: comunicação em congresso @pt
alternative label: објављено саопштење са конференције
alternative label: konferencepapir @da
preferred label: articol de conferinţă @ro
alternative label: اوراق المؤتمر @ar
alternative label: trabajo presentado en una conferencia @es
broad match: Event
preferred label: příspěvek na konferenci @cs
preferred label: conferentie paper @nl
alternative label: documento presentado en una conferencia @es
alternative label: trabajo presentado en un congreso @es
preferred label: Konferenzbeitrag @de
alternative label: article de congrès @fr
alternative label: documento presentado en un congreso @es
alternative label: article de conférence @fr
alternative label: presentación de congreso @es
preferred label: 会議発表論文 @ja
alternative label: comunicacion de congreso @es
preferred label: конференционный доклад @ru
preferred label: άρθρο συνεδρίου @el
preferred label: comunicación de congreso @gl
broader: зборник саопштења са конференције
preferred label: konferenceoplæg @da
preferred label: 학술대회 논문 @ko
type: Concept
alternative label: рад са конференције
alternative label: apresentação em conferência @pt
in scheme: Resource Types
alternative label: comunicación de conferencia @es
preferred label: članek na konfrenci @sl
preferred label: ورقة مؤتمر @ar
preferred label: доповідь на конференції @uk
alternative label: comunicacion de conferencia @es
preferred label: artikkeli konferenssijulkaisussa @fi
preferred label: konferans belgesi @tr
preferred label: comunicació de congrés @ca
alternative label: prispevek na konferenci @sl
alternative label: apresentação em congresso @pt
alternative label: rad sa konferencije
preferred label: paper i proceeding @sv
preferred label: conference paper @en
alternative label: presentacion de congreso @es
definition: A paper, published within a conference proceeding, typically the realization of a research paper reporting original research findings. [Source: Adapted from https://sparontologies.github.io/fabio/current/fabio.html#d4e2635] @en
alternative label: članek na konferenci @sl
preferred label: kutatási jelentés konferenciaközleményben @hu
alternative label: konferenceartikel @da
alternative label: článek ve sborníku konference @cs
preferred label: 会议论文 @zh
alternative label: objavljeno saopštenje sa konferencije
alternative label: 會議論文 @zh
preferred label: саопштење са конференције
preferred label: comunicação em conferência @pt
alternative label: 会议文章 @zh
alternative label: artigo de congresso @pt
preferred label: article dans une conférence @fr
alternative label: artigo de conferência @pt

preprint
alternative label: artículo sin revisión por pares @es
alternative label: articulo preliminar @es
in scheme: Resource Types
editorial note: Deprecated @en
alternative label: artigo sem revisão @pt
preferred label: препринт
preferred label: Preprint @de
alternative label: borrador @es
preferred label: ön baskı @tr
preferred label: prépublication @fr
broader: teksti
preferred label: プレプリント @ja
alternative label: voordruk @nl
preferred label: طبعة أولية @ar
alternative label: articulo sin revision por pares @es
alternative label: prepublicación @es
alternative label: préprint @fr
alternative label: artigo preliminar @pt
preferred label: artículo preliminar @es
preferred label: προεκτύπωση @el
definition: A preprint is a scientific manuscript without peer-review and has not yet been accepted by a journal, typicaly submitted to a public server/ repository by the author. [Source: Adapted from https://asapbio.org/preprint-info/preprint-faq#qaef-637] @en
preferred label: 预印本 @zh
preferred label: versión enviada @gl
preferred label: articolo preliminare @it
broad match: Text
alternative label: Vorabdruck @de
preferred label: publicació preliminar @ca
alternative label: 先印本 @zh
preferred label: pre-tipărire @ro
type: Concept

novine
preferred label: jornal @pt
preferred label: ziar @ro
preferred label: newspaper @en
editorial note: Published @en
preferred label: periódico @es
preferred label: tidning @sv
preferred label: صحيفة @ar
type: Concept
preferred label: 报纸 @zh
preferred label: sanomalehti @fi
preferred label: 新聞 @ja
preferred label: časopis @sl
preferred label: gazete @tr
narrower: новински чланак
preferred label: εφημερίδα @el
preferred label: diari @ca
in scheme: Resource Types
preferred label: Zeitung @de
preferred label: газета @uk
definition: A non-peer reviewed periodical, usually published daily or weekly, consisting primarily of editorials and news items concerning current or recent events and matters of public interest. [Source: https://sparontologies.github.io/fabio/current/fabio.html#d4e4291] @en
broader: teksti
preferred label: avis @da
preferred label: újság @hu
alternative label: časnik @sl
preferred label: giornale @it
preferred label: новине
preferred label: journal @fr
alternative label: diario @es
preferred label: krant @nl

expediente xudicial
alternative label: documentation judiciaire @fr
alternative label: acte judiciare @ro
alternative label: Gerichtsdokumente @de
alternative label: retsprotokoller @da
editorial note: New concept included for version 4 or resource types Vocab @en
preferred label: sodni dokumenti @sl
alternative label: document des tribunaux @fr
preferred label: processos judiciais @pt
alternative label: documents judicials @ca
preferred label: 法庭文件 @zh
preferred label: atti giudiziari @it
preferred label: retsdokumenter @da
preferred label: Prozessakte @de
alternative label: Gerichtsakte @de
preferred label: судові матеріали @uk
definition: A set of judicial proceedings that record, physically or digitally, and in an orderly fashion, the development of a process or procedural actions so that they may be recorded and examined by the parties. This would include the set of judicial proceedings and any item within that set as a physical or electronic court document. Adapted from https://dpej.rae.es/lema/expediente-judicial with input from https://www.supremecourt.gov/case_documents.aspx @en
type: Concept
preferred label: adli belgeler @tr
alternative label: matériel juridique @fr
in scheme: Resource Types
preferred label: δικαστικά έγγραφα @el
alternative label: dokumenti sodišč @sl
preferred label: 裁判所文書 @ja
broader: збирка
preferred label: court documents @en
preferred label: document judiciaire @fr
preferred label: bírósági dokumentumok @hu
preferred label: expedient judicial @ca
broad match: d4e3790
preferred label: rättsliga dokument @sv
preferred label: وثائق قضائية @ar
alternative label: documentos judiciais @pt
alternative label: sodni spisi @sl
preferred label: 법원문서 @ko
preferred label: documente judiciare @ro
broad match: D016418
preferred label: expediente judicial @es
alternative label: documenti giudiziari @it

Resource Types
has top concept: звучни запис
has top concept: остало
has top concept: interni izveštaj
has top concept: наставни материјал
has top concept: teksti
has top concept: збирка
has top concept: istraživački instrument
has top concept: informativni prilog
has top concept: интерактивна грађа
has top concept: периодична публикација
has top concept: fizički uzorak
has top concept: рачунарски програм
has top concept: research data
has top concept: картографска грађа
has top concept: скуп података
has top concept: друге врсте извештаја
has top concept: zaštitni znak
type: ConceptScheme
has top concept: sistem organizacije znanja
has top concept: radni proces
has top concept: umetničko delo
has top concept: interview
has top concept: дизајн
has top concept: slika
has top concept: patent
has top concept: relatório para organismo financiador
has top concept: Teilbericht
modified: 2024-12-04T14:59:40+00:00
description: The Resource Type vocabulary defines concepts to identify the genre of a resource. Such resources, like publications, research data, audio and video objects, are typically deposited in institutional and thematic repositories or published in ejournals. This vocabulary supports a hierarchical model that relates narrower and broader concepts. Multilingual labels regard regional distinctions in language and term. Concepts of this vocabulary are mapped with terms and concepts of similar vocabularies and dictionaries.
creator: Isabel Bernal, CSIC, Spain (Editorial Board Chair)
creator: Joseph Cera, University of California-Berkeley, US
creator: Mick Eadie, University of Glasgow, United Kingdom
creator: Benedetta Gandolini, 4Science, Italy
creator: Sebastiano Giorgi, UOC, Spain
creator: Gültekin Gürdal, Izmir Institute of Technology Library, Turkey
creator: Pierre Lasou, Université Laval, Canada
creator: Yoo Young Lee, University of Ottawa, Canada
creator: Ku (Alan) Liping, Chinese Academy of Science
creator: Katharina Menhard, Technische Universität Graz, Austria
creator: Gretchen Neidhardt, Northwestern University, United States
creator: Milan Ojsteršek, University of Maribor, Slovenia
creator: Pedro Príncipe, Universidade do Minho, Portugal
creator: Ellen Ramsey, COAR
creator: Jochen Schirrwagen, Aachen University, Germany
creator: Corinna Schneider, Technische Informationsbibliothek (TIB), Germany
creator: Milica Sevkusic, EIFL Serbia
creator: Kathleen Shearer, COAR
contributor: Barbara Aristidou, Cyprus University of Technology, Cyprus
contributor: Rawia Awadallah, Arab States Research and Education Network
contributor: Aysen Binen, Izmir Institute of Technology, Turkey
contributor: Jessica Byström, Chalmers University, Sweden
contributor: Julie Gauthier, University of Montreal, Canada
contributor: Diana Furcila Mihalache, FECYT, Spain
contributor: Hyekyong Hwang, KISTI, Korea
contributor: Krisztina Korosi, University Library of Corvinus University of Budapest, Hungary
contributor: Iryna Kuchma, EIFL, Ukraine
contributor: Christian Lacroix, University of Montreal, Canada
contributor: Petra Magnusson, Chalmers University, Sweden
contributor: George Macgregor, University of Glasgow, UK
contributor: Antonia Nicolaou, Cyprus University of Technology, Cyprus
contributor: Carmen Posse, University Library of Santiago de Compostela, Spain
contributor: Irina Razumova, COAR
contributor: Sa-kwang Song, KISTI, Korea
contributor: Paul Walk, Antleaf, UK

чланак о рачунарском програму
preferred label: статья по программному обеспечению @ru
broader: članak u časopisu
alternative label: чланак о софтверу
preferred label: εργασία λογισμικού @el
preferred label: szoftverdokumentáció @hu
alternative label: članak o softveru
alternative label: опис софтвера
preferred label: artigo de software @gl
alternative label: άρθρο λογισμικού @el
broad match: JournalArticle
preferred label: članek o programski opremi @sl
editorial note: Published @en
preferred label: ورقة برمجيات @ar
preferred label: articol despre software @ro
preferred label: 软件论文 @zh
alternative label: opis računarskog programa
preferred label: software paper @en
alternative label: 指关于软件设计、开发、应用等方面的学术论文 @zh
alternative label: опис рачунарског програма
alternative label: opis programske opreme @sl
definition: A software paper should include the rationale for the development of the tool and details of the code used for its construction. [Source: Adapted from https://f1000research.com/for-authors/article-guidelines/software-tool-articles ] @en
preferred label: ohjelmistoa kuvaava artikkeli @fi
alternative label: article décrivant un logiciel @fr
preferred label: article sur un logiciel @fr
in scheme: Resource Types
alternative label: articol despre program @ro
type: Concept
preferred label: artículo de software @es
preferred label: software artikel @da
preferred label: yazılım makalesi @tr
alternative label: article sobre programari @ca
preferred label: 소프트웨어 논문 @ko
preferred label: descripció de programari @ca
preferred label: стаття - програмне забезпечення @uk
preferred label: Softwareartikel @de
alternative label: opis softvera
preferred label: ソフトウェア論文 @ja
preferred label: članak o računarskom programu

патент за дизајн
preferred label: патент на образец @ru
preferred label: патент на дизайн @uk
broad match: d4e4551
preferred label: brevet de conception @fr
broader: patent
preferred label: brevet de design @ro
in scheme: Resource Types
type: Concept
preferred label: 디자인 특허 @ko
alternative label: registo de modelo @pt
preferred label: designregistrering @da
preferred label: patent de disseny @ca
preferred label: design patent @en
definition: A patent granted to any person who has invented any new and non-obvious ornamental design for an article of manufacture. The design patent protects only the appearance of an article, but not its structural or functional features. [Source: Adapted from https://www.uspto.gov/patents/basics/types-patent-applications/design-patent-application-guide#def] @en
preferred label: tasarım patenti @tr
preferred label: mallipatentti @fi
preferred label: brevetto di design @it
preferred label: patente de deseño @gl
preferred label: 意匠特許 @ja
preferred label: patente de diseño @es
preferred label: designskydd @sv
preferred label: براءة اختراع تصميم @ar
alternative label: brevet de proiectare @ro
preferred label: registo de desenho @pt
preferred label: patent za oblikovanje @sl
preferred label: modelbescherming @nl
alternative label: tasarım tescili @tr
alternative label: mönsterskydd @sv
preferred label: Eingetragenes Design @de
preferred label: formatervezési minta @hu
preferred label: 设计专利 @zh
preferred label: patent za dizajn

podaci merenja i ispitivanja
preferred label: δεδομένα μετρήσεων και δοκιμών @el
preferred label: datos de medicións e probas @gl
preferred label: measurement and test data @en
preferred label: måle- og testdata @da
related match: http://vocabs.lter-europe.net/elter_cl/10017
preferred label: mittaus- ja testausdata @fi
preferred label: 측정・시험 데이터 @ko
preferred label: dados de medição e de ensaio @pt
preferred label: datos de medición y prueba @es
definition: Data resulting from assessing specific properties (or characteristics) of beings, things, phenomena, (and/ or processes) by applying pre-established standards and/or specialized instruments or techniques. [Source: Adapted from https://ddialliance.org/Specification/DDI-CV/ModeOfCollection_3.0.html] @en
preferred label: donnée de mesure et d'essai @fr
preferred label: date de măsurare și testare @ro
preferred label: dades de mesures i proves @ca
preferred label: بيانات قياس واختبار @ar
preferred label: данные измерений и испытаний @ru
preferred label: 測定・評価データ @ja
broader: скуп података
preferred label: merilni in testni podatki @sl
preferred label: подаци мерења и испитивања
preferred label: дані вимірювання і випробування @uk
preferred label: meet- en testdata @nl
preferred label: Mess- und Testdaten @de
preferred label: dati di misurazione e test @it
preferred label: 测量与测试数据 @zh
type: Concept
preferred label: mérési és tesztelési adatok @hu
preferred label: ölçüm ve test verisi @tr
in scheme: Resource Types

радни документ
preferred label: documento de traballo @gl
preferred label: document de travail @fr
alternative label: 未發表論文 @zh
preferred label: műhelytanulmány @hu
preferred label: arbejdspapir @da
alternative label: discussion paper @en
in scheme: Resource Types
preferred label: working paper @it
preferred label: document de lucru @ro
type: Concept
alternative label: ön makale @tr
alternative label: werkdocument @nl
preferred label: pracovní dokument @cs
alternative label: arbejdsnotat @da
alternative label: çalışma belgesi @tr
definition: A working or discussion paper circulated publicly or among a group of peers. Certain disciplines, for example economics, issue working papers in series. [Source: http://www.ukoln.ac.uk/repositories/digirep/index/Eprints_Type_Vocabulary_Encoding_Scheme#:~:text=http%3A//purl.org/eprint/type/WorkingPaper] @en
preferred label: Arbeitspapier @de
alternative label: documento di lavoro @it
preferred label: 研究手稿 @zh
alternative label: working or discussion paper @en
alternative label: borrador de trabajo @es
preferred label: робочий документ @uk
alternative label: ورقة قيد العمل @ar
preferred label: document de treball @ca
alternative label: préprint @fr
broader: teksti
preferred label: radni dokument
alternative label: documento de trabalho @pt
alternative label: 未发表论文 @zh
alternative label: memorando de investigação @pt
alternative label: documento de trabalho de investigação @pt
preferred label: έγγραφο εργασίας @el
preferred label: çalışma raporu @tr
preferred label: ワーキングペーパー @ja
broad match: Text
preferred label: delovna verzija članka @sl
alternative label: 工作底稿 @zh
alternative label: working papers @en
preferred label: työpaperi @fi
preferred label: documento de trabajo @es
alternative label: papier de travail @fr
preferred label: 워킹페이퍼 @ko
preferred label: рабочий документ @ru
alternative label: prepublicació @ca
alternative label: documento de reflexão @pt
preferred label: ورقة عمل @ar

relatório para organismo financiador
alternative label: končno poročilo o rezultatih raziskav @sl
definition: A report to a funding agency is a document written by beneficiaries of project grants. The reporting documents can be e.g. periodic reports about progress of scientific and technical work and final report. For deliverables use ‘Project deliverable’. [Source: http://ec.europa.eu/research/participants/fp7documents/funding-guide/6_projects/reports/reports_en.htm ] @en
preferred label: 助成研究成果報告書 @ja
preferred label: informe a organismo financiador @es
alternative label: 給資助機構的報告 @zh
expires: 2021-03-12
top concept of: Resource Types
preferred label: Bericht an Förderorganisation @de
preferred label: rapport à l'intention du financeur @fr
preferred label: report to funding agency @en
preferred label: 给资助机构的报告 @zh
preferred label: fon sağlayıcıya rapor @tr
alternative label: reporte a agencia de financiamento @es
preferred label: rapporto a un'agenzia di finanziamento @it
preferred label: informe per una agència de finançament @ca
preferred label: تقرير لوكالة تمويل @ar
alternative label: relatório para financiador @pt
preferred label: zpráva pro poskytovatele podpory @cs
preferred label: poročilo financerjem raziskave @sl
alternative label: relatório para agência de financiamento @pt
in scheme: Resource Types
alternative label: rapport au financeur @fr
editorial note: Deprecated @en
type: Concept
alternative label: rapportage voor financier @nl
alternative label: informe a agencia financiadora @es
alternative label: poročilo financerjem projekta @sl

збирка
preferred label: coleção @pt
preferred label: 收藏品 @zh
in scheme: Resource Types
preferred label: kolekcija
preferred label: collezione @it
alternative label: repertorio @es
preferred label: koleksiyon @tr
definition: An aggregation of resources, which may encompass collections of one resourceType as well as those of mixed types. A collection is described as a group; its parts may also be separately described. https://datacite-metadata-schema.readthedocs.io/en/4.5/appendices/appendix-1/resourceTypeGeneral/#collection @en
narrower: expediente xudicial
alternative label: acervo @es
alternative label: колекција
narrower: arhivska zbirka
preferred label: gyűjtemény @hu
preferred label: colecție @ro
preferred label: colección @gl
preferred label: колекція @uk
preferred label: collection @en
preferred label: samling @sv
preferred label: συλλογή @el
preferred label: col·lecció @ca
alternative label: собрание @ru
preferred label: коллекция @ru
preferred label: zbirka
preferred label: Sammlung @de
top concept of: Resource Types
editorial note: New concept included for version 4 of Resource types Vocab @en
preferred label: 컬렉션 @ko
preferred label: مجموعة @ar
preferred label: コレクション @ja
type: Concept

tehnička dokumentacija
broader: teksti
preferred label: technical documentation @en
preferred label: 技术资料 @zh
alternative label: documentacion tecnica @es
preferred label: tekninen dokumentaatio @fi
broad match: Document
preferred label: documentació tècnica @ca
alternative label: 技術文檔 @zh
alternative label: 技术文档 @zh
broad match: Text
preferred label: documentație tehnică @ro
preferred label: documentação técnica @pt
alternative label: manual @ca
preferred label: documentación técnica @gl
definition: Technical documentation refers to any type of documentation that describes handling, functionality and architecture of a technical product or a product under development or use. [Source: https://en.wikipedia.org/wiki/Technical_documentation] @en
preferred label: teknisk dokumentation @sv
preferred label: 技術文書 @ja
preferred label: manuel technique @fr
preferred label: Technische Dokumentation @de
preferred label: τεχνική τεκμηρίωση @el
alternative label: documentation technique @fr
preferred label: 기술문서 @ko
preferred label: техничка документација
preferred label: technische documentatie @nl
alternative label: وثائق تقنية @ar
preferred label: teknik dokümantasyon @tr
alternative label: Technische Unterlagen @de
alternative label: manuale tecnico @it
preferred label: documentazione tecnica @it
preferred label: műszaki dokumentáció @hu
alternative label: 技術資料 @zh
type: Concept
preferred label: وثائق فنية @ar
preferred label: техническая документация @ru
preferred label: technická dokumentace @cs
in scheme: Resource Types
alternative label: 技術文獻 @zh
preferred label: tehnična dokumentacija @sl
alternative label: manual técnico @pt
preferred label: технічна документація @uk
alternative label: 技术文献 @zh

tekst na blogu
alternative label: postare de blog @ro
preferred label: entrada de blog @es
preferred label: articol de blog @ro
preferred label: текст на блогу
alternative label: missatge de blog @ca
alternative label: تدوينة مدونة @ar
broad match: d4e5915
preferred label: blogiteksti @fi
editorial note: Published @en
preferred label: Blogbeitrag @de
preferred label: blogbejegyzés @hu
preferred label: допис у блозі @uk
preferred label: ブログ記事 @ja
preferred label: Blog yazısı @tr
in scheme: Resource Types
alternative label: post de blog @fr
alternative label: billet de blog @fr
alternative label: notícia de blog @ca
type: Concept
broad match: Blog
broad match: WebContent
preferred label: 블로그 기사 @ko
preferred label: منشور مدونة @ar
broad match: http://purl.bioontology.org/ontology/MESH/D000069520
preferred label: blogindlæg @da
preferred label: prispevek na blogu @sl
preferred label: blog post @nl
preferred label: 博客文章 @zh
alternative label: apunt de blog @ca
preferred label: пост @ru
preferred label: articolo di blog @it
alternative label: пост в блоге @ru
preferred label: blogginlägg @sv
preferred label: artigo de blogue @pt
broader: teksti
alternative label: post de blogue @pt
preferred label: ανάρτηση ιστολογίου @el
definition: A piece of writing or other item of content published on a blog. [Source: https://www.lexico.com/definition/blog_post] @en
preferred label: article de blog @fr
alternative label: publicação em blogue @pt

приказ књиге
preferred label: note de lecture @fr
preferred label: book review @en
preferred label: könyvismertetés @hu
preferred label: recensión de libro @gl
alternative label: resenha de livro @pt
type: Concept
alternative label: Buchkritik @de
preferred label: рецензия на книгу @ru
preferred label: bokrecension @sv
preferred label: boekbespreking @nl
alternative label: boek review @nl
alternative label: crítica de llibre @ca
preferred label: 書評 @ja
preferred label: recenze knihy @cs
preferred label: reseña de libro @es
in scheme: Resource Types
preferred label: 서평 @ko
preferred label: резензія на книгу @uk
preferred label: kirja-arvostelu @fi
preferred label: مراجعة كتاب @ar
alternative label: comentario de libro @es
preferred label: ressenya de llibre @ca
alternative label: recension de libro @es
alternative label: نقد كتاب @ar
definition: A written review and critical analysis of the content, scope and quality of a book or other monographic work. [Source: https://sparontologies.github.io/fabio/current/fabio.html#d4e2300] @en
preferred label: recensione di libro @it
alternative label: critique de livre @fr
alternative label: recension d'ouvrage @fr
alternative label: critica de libro @es
alternative label: Buchbesprechung @de
preferred label: 书评 @zh
broader: prikaz
preferred label: Buchrezension @de
preferred label: recenzija knjige @sl
preferred label: recensão de livro @pt
preferred label: κριτική βιβλίου @el
alternative label: recensão crítica @pt
alternative label: recensió de llibre @ca
preferred label: boganmeldelse @da
alternative label: ficha de leitura @pt
preferred label: prikaz knjige
preferred label: kitap eleştirisi @tr
preferred label: recenzie de carte @ro
alternative label: crítica de libro @es

чланак у информативној ревији
preferred label: magazin makalesi @tr
preferred label: Zeitschriftenartikel @de
preferred label: 잡지 기사 @ko
alternative label: чланак у магазину
preferred label: article de magazine @fr
preferred label: стаття у журналі @uk
preferred label: magazincikk @hu
preferred label: magazine article @en
preferred label: artículo de magacín @es
preferred label: 雑誌記事 @ja
preferred label: članak u informativnoj reviji
preferred label: artigo de revista divulgativa @gl
preferred label: časopisni članek @sl
alternative label: articolo scientifico @it
type: Concept
preferred label: magasinartikel @da
preferred label: articolo in rivista @it
alternative label: članak u magazinu
in scheme: Resource Types
broader: informativna revija
definition: An Item appearing in a magazine (a general interest or specific focus periodical). This item is often shorter in length, is submitted by in-house and external authors. Adapted from MAGAZINE Definition & Meaning - Black's Law Dictionary (thelawdictionary.org) @en
editorial note: New concept added to be included in upcoming version 4.0 @en
preferred label: artikel i magasin @sv
preferred label: article de divulgació @ca
preferred label: مقال في مجلة @ar
preferred label: artigo em revista @pt

transkript
broader: teksti
preferred label: نسخ نصي @ar
preferred label: transcriptie @nl
preferred label: transkripcija @sl
preferred label: transcription @fr
preferred label: transzkripció @hu
preferred label: transcrición @gl
definition: A written record of words spoken in court proceedings or in a speech, interview, broadcast, or sound recording. [Source: Adapted from https://products.abc-clio.com/ODLIS/odlis_t.aspx] @en
preferred label: litteroitu teksti @fi
preferred label: transkripsiyon @tr
alternative label: 誊写记录 @zh
preferred label: траскрипт @uk
preferred label: 전사 @ko
alternative label: prepis @sl
preferred label: transskription @da
broad match: Text
preferred label: Transkription @de
preferred label: транскрипт
preferred label: транскрипция @ru
type: Concept
preferred label: transkription @sv
preferred label: trascrizione @it
preferred label: transcrição @pt
preferred label: transcripció @ca
preferred label: transcripción @es
preferred label: μεταγραφή @el
preferred label: 文字起こし @ja
in scheme: Resource Types
preferred label: transcriere @ro
preferred label: 转录资料 @zh

neobjavljeno saopštenje sa konferencije
preferred label: comunicazione non pubblicata in atti di congresso @it
alternative label: comunicação não publicada nas atas do congresso @pt
preferred label: konferenssiesitelmä erillisjulkaisuna @fi
preferred label: conferentie artikel niet in proceedings @nl
preferred label: article dans une conférence non publié dans les actes @fr
preferred label: neobjavljen članek na konferenci @sl
preferred label: konferenciaköteten kívüli közlemény @hu
in scheme: Resource Types
preferred label: 非会议集里的会议论文 @zh
alternative label: artigo não publicado nas atas do congresso @pt
definition: A paper, typically the realization of a research paper reporting original research findings. Use this label when the paper is not published in a proceeding. [Source: Adapted from http://purl.org/spar/fabio/ConferencePaper] @en
broader: konferencijski prilog
preferred label: comunicación no publicada en actas de congreso @es
preferred label: konferenceoplæg ikke i konferencehandlinger @da
preferred label: paper ej i proceeding @sv
preferred label: ورقة مؤتمر ليست ضمن وقائع المؤتمر @ar
type: Concept
alternative label: konferencepapir ikke i konferencehandlinger @da
alternative label: artigo não publicado nas atas da conferência @pt
preferred label: конференционный доклад не включенный в материалы конференции @ru
preferred label: Konferenzbeitrag nicht im Tagungsband @de
preferred label: comunicación de congreso non publicada nas actas @gl
preferred label: доповідь конференції яка не увійшла до збірника @uk
alternative label: 未發表在會議論文集中的文章 @zh
preferred label: άρθρο συνεδρίου που δε δημοσιεύτηκε στα πρακτικά @el
preferred label: необјављено саопштење са конференције
preferred label: yayınlanmamış konferans bildirisi @tr
alternative label: konferenceartikel ikke i konferencehandlinger @da
alternative label: article de conférence non publié dans les actes @fr
preferred label: comunicació de congrés no publicada @ca
preferred label: conference paper not in proceedings @en
editorial note: Proposed deprecated @en
preferred label: konferenční příspěvek nezahrnutý ve sborníku @cs
preferred label: 미게재 학술대회 논문 @ko
preferred label: 会議発表論文（会議録未掲載） @ja
preferred label: comunicação não publicada nas atas da conferência @pt
preferred label: lucrare de conferinţă nepublicată @ro

rukopis
broader: teksti
preferred label: рукопись @ru
alternative label: El yazması @tr
alternative label: rukopisna građa
preferred label: käsikirjoitus @fi
preferred label: Manuskript @de
alternative label: Handschrift @de
preferred label: manuscris @ro
alternative label: handschrift @nl
alternative label: rokopis @sl
preferred label: manuscrit @ca
preferred label: kézirat @hu
preferred label: рукопис
preferred label: 手稿 @zh
alternative label: document original @ca
preferred label: manoscritto @it
preferred label: manuscrito @pt
preferred label: 원고 @ko
alternative label: манускрипт @ru
preferred label: manuskript @da
editorial note: Published @en
preferred label: manuscript @en
definition: A manuscript is a work of any kind (text, inscription, music score, map, etc.) written entirely by hand. [Source: https://products.abc-clio.com/ODLIS/odlis_m.aspx] @en
in scheme: Resource Types
type: Concept
preferred label: مخطوطة @ar
preferred label: χειρόγραφο @el
alternative label: рукописна грађа
preferred label: Yazma eser @tr

plan upravljanja podacima
preferred label: piano di gestione dei dati @it
preferred label: adatkezelési terv @hu
preferred label: 데이터관리계획 @ko
preferred label: Datenmanagementplan @de
preferred label: plan de gestionare a datelor @ro
preferred label: план управления данными @ru
preferred label: データ管理計画 @ja
preferred label: plan de gestion de données @fr
preferred label: 数据管理计划 @zh
editorial note: Published @en
preferred label: datanhallintasuunnitelma @fi
preferred label: načrt ravnanja s podatki @sl
in scheme: Resource Types
alternative label: načrt upravljanja s podatki @sl
preferred label: план управљања подацима
preferred label: план управління даними @uk
preferred label: datahanteringsplan @sv
preferred label: veri yönetim planı @tr
definition: A formal statement describing how research data will be managed and documented throughout a research project and the terms regarding the subsequent deposit of the data with a data repository for long-term management and preservation. [Source: https://casrai.org/rdm-glossary] @en
preferred label: plan de gestión de datos @es
type: Concept
preferred label: plan de xestión de datos @gl
broad match: OutputManagementPlan
preferred label: data management plan @en
preferred label: pla de gestió de dades @ca
alternative label: datahåndteringsplan @da
broader: извештај
preferred label: plano de gestão de dados @pt
preferred label: خطة إدارة البيانات @ar
alternative label: pla d’administració de dades @ca
preferred label: σχέδιο διαχείρισης δεδομένων @el

predlog istraživačkog projekta
alternative label: réponse à appel à projet @fr
preferred label: tutkimusehdotus @fi
preferred label: návrh výzkumného projektu @cs
alternative label: researchProposal @en
preferred label: дослідницька пропозиція @uk
preferred label: onderzoeksvoorstel @nl
related match: d4e3400
preferred label: predlog raziskave @sl
preferred label: forsknings-forslag @da
preferred label: proposta de investigación @gl
alternative label: propuesta de proyecto @es
broader: teksti
preferred label: projet de recherche @fr
preferred label: مقترح بحثي @ar
alternative label: proposta de proxecto @gl
preferred label: kutatási terv @hu
preferred label: research proposal @en
broad match: Text
alternative label: 研究方案 @zh
alternative label: 研究計劃 @zh
preferred label: 연구 계획서 @ko
alternative label: proposta di ricerca @it
definition: A research proposal is a document proposing a research project, generally in the sciences or academia, and generally constitutes a request for sponsorship of that research. [Source: https://en.wikipedia.org/wiki/Research_proposal] @en
preferred label: Exposé @de
preferred label: propuesta de investigación @es
preferred label: предлог истраживачког пројекта
preferred label: propunere de cercetare @ro
preferred label: propuesta de recerca @ca
preferred label: proposta di progetto @it
preferred label: ερευνητική πρόταση @el
preferred label: 研究计划 @zh
alternative label: propuesta d'investigació @ca
in scheme: Resource Types
type: Concept
alternative label: propuesta de projecte @ca
preferred label: forskningsförslag @sv
preferred label: 研究計画書 @ja
alternative label: raziskovalna prijava @sl
preferred label: proposta de investigação @pt
preferred label: araştırma önerisi @tr
alternative label: مقترح بحث @ar
alternative label: propuesta de investigacion @es
preferred label: исследовательское предложение @ru
alternative label: proposta de projeto @pt

pokretne slike
alternative label: imagine dinamică @ro
definition: A moving display, either generated dynamically by a computer program or formed from a series of pre-recorded still images imparting an impression of motion when shown in succession. [Source: http://purl.org/spar/fabio/MovingImage] @en
narrower: vidéo
preferred label: 動画 @ja
broader: slika
type: Concept
preferred label: imatge en moviment @ca
preferred label: liikkuva kuva @fi
alternative label: imagem em movimento @pt
preferred label: pohyblivý obraz @cs
preferred label: hareketli görüntü @tr
alternative label: imagen dinamica @es
preferred label: рухоме зображення @uk
preferred label: imaxe en movemento @gl
preferred label: gibljiva slika @sl
preferred label: 동영상 @ko
preferred label: mozgókép @hu
preferred label: imagen dinámica @es
preferred label: κινούμενες εικόνες @el
preferred label: image animée @fr
preferred label: imagem animada @pt
preferred label: immagine dinamica @it
preferred label: moving image @en
preferred label: покретне слике
preferred label: движущееся изображение @ru
preferred label: rörlig bild @sv
alternative label: imagen en movimiento @es
preferred label: imagine în mișcare @ro
alternative label: سمعي بصري @ar
alternative label: 動畫 @zh
alternative label: 动画 @zh
preferred label: صورة متحركة @ar
preferred label: 运动图像 @zh
alternative label: audiovisual @en
alternative label: 運動圖像 @zh
preferred label: filmmateriaal @nl
preferred label: Bewegte Bilder @de
in scheme: Resource Types

istraživački instrument
alternative label: raziskovalni inštrument @sl
preferred label: kutatási eszköz @hu
alternative label: equipament de laboratori @ca
preferred label: ερευνητικό εργαλείο @el
preferred label: instrument de recherche @fr
top concept of: Resource Types
editorial note: New concept included for version 4 of resource types Vocab @en
preferred label: أداة بحث @ar
preferred label: forskningsinstrument @sv
alternative label: equipamiento de laboratorio @es
preferred label: 実験装置 @ja
alternative label: instrumentación científica @es
preferred label: araştırma cihazı @tr
preferred label: instrumento de investigação @pt
alternative label: strumento scientifico @it
in scheme: Resource Types
alternative label: instrumento de pesquisa @pt
alternative label: strumento di ricerca @it
preferred label: instrumento de investigación @es
preferred label: research instrument @en
preferred label: instrument de cercetare @ro
preferred label: instrument de recerca @ca
type: Concept
preferred label: raziskovalno orodje @sl
preferred label: 研究工具 @zh
preferred label: Forschungsinstrument @de
alternative label: instrumentació científica @ca
preferred label: strumentazione @it
preferred label: інструмент дослідження @uk
preferred label: истраживачки инструмент
preferred label: инструмент исследования @ru
preferred label: 연구장비 @ko
definition: A device, tool or apparatus used to obtain, measure and/or analyze data. Source https://datacite-metadata-schema.readthedocs.io/en/4.5/appendices/appendix-1/resourceTypeGeneral/#instrument @en

izvorni softverski kod
preferred label: lähdekoodi @fi
preferred label: 源代码 @zh
preferred label: code source @fr
broader: рачунарски програм
alternative label: brontekst @nl
preferred label: исходный код @ru
preferred label: källkod @sv
preferred label: forráskód @hu
preferred label: كود المصدر @ar
alternative label: softwarekode @da
preferred label: broncode @nl
in scheme: Resource Types
preferred label: source code @en
preferred label: 소스 코드 @ko
preferred label: Quellcode @de
preferred label: cod sursă @ro
preferred label: ソースコード @ja
type: Concept
preferred label: código fonte @gl
alternative label: الشفرة المصدرية @ar
preferred label: вихідний код @uk
preferred label: codi font @ca
preferred label: kaynak kodu @tr
preferred label: codice sorgente @it
definition: Source code is any collection of code, with or without comments, written using a human-readable programming language, usually as plain text. [Source: https://en.wikipedia.org/wiki/Source_code] @en
preferred label: izvorna koda @sl
preferred label: código fuente @es
preferred label: kildekode @da
preferred label: πηγαίος κώδικας @el
preferred label: изворни софтверски код

podaci iz kliničkih ispitivanja
alternative label: klinisch-wetenschappelijke data @nl
in scheme: Resource Types
preferred label: date din studii clinice @ro
alternative label: essai thérapeutique @fr
preferred label: klinische Daten @de
preferred label: clinical trial data @en
preferred label: дані клінічних досліджень @uk
preferred label: klinische studie data @nl
preferred label: dati di trial clinico @it
preferred label: 임상시험 데이터 @ko
preferred label: 临床试验数据 @zh
preferred label: dados de ensaios clínicos @pt
preferred label: δεδομένα κλινικών δοκιμών @el
preferred label: podatki kliničnih preskušanj @sl
alternative label: randomized control trial @en
preferred label: klinik deney verisi @tr
preferred label: بيانات تجارب سريرية @ar
alternative label: date obţinute în studii clinice @ro
broader: скуп података
preferred label: ensayo clínico @es
preferred label: 臨床試験データ @ja
alternative label: подаци из клиничких студија
alternative label: klinisk forsøg data @da
preferred label: kliinisellä kokeella tuotettu data @fi
preferred label: datos de ensaios clínicos @gl
alternative label: date clinice de testare @ro
preferred label: donnée d'essai clinique @fr
editorial note: Published @en
alternative label: podaci iz kliničkih studija
preferred label: klinikai vizsgálati adatok @hu
preferred label: dades d'assajos clínics @ca
preferred label: данные клинических испытаний @ru
alternative label: klinično preskušanje @sl
preferred label: data fra kliniske forsøg @da
alternative label: dades d'estudis clínics @ca
broad match: Dataset
broad match: studyregistration
type: Concept
definition: Data resulting from a research study in which one or more human subjects are prospectively assigned to one or more interventions (which may include placebo or other control) to evaluate the effects of those interventions on health-related biomedical or behavioral outcomes. [Source: Adapted from https://grants.nih.gov/policy/clinical-trials/definition.htm] @en
preferred label: подаци из клиничких испитивања

erratum
alternative label: ملحق تصحيحي @ar
alternative label: Berichtigung @de
alternative label: fe de erratas @es
alternative label: исправка
preferred label: 勘误表（指对出版物中错误的更正或修正表） @zh
preferred label: تصحيح @ar
preferred label: corrigendum
preferred label: 正誤表 @ja
related match: d4e3154
in scheme: Resource Types
preferred label: правки @ru
preferred label: παρόραμα @el
preferred label: errata @sv
preferred label: Korrigendum @de
alternative label: исправление @ru
type: Concept
preferred label: corrigenda @es
preferred label: berigtigelse @da
alternative label: fe d'errates @ca
preferred label: 정오표 @ko
preferred label: düzeltme @tr
alternative label: ispravka
preferred label: rectificare @ro
broader: članak u časopisu
broad match: d4e2698
preferred label: popravek članka @sl
definition: A formal correction to an error introduced by the author into a previously published document. (adapted from https://sparontologies.github.io/fabio/current/fabio.html#d4e2712) @en
preferred label: corrección de erros @gl
alternative label: correcció @ca
preferred label: correcció d’errors @ca
preferred label: виправлення @uk
preferred label: hibajegyzék @hu
editorial note: Published @en

књига
broader: teksti
alternative label: monografia @pt
preferred label: livro @pl
preferred label: libro @es
definition: A non-serial publication that is complete in one volume or a designated finite number of volumes. [Source: Adapted from http://purl.org/eprint/type/Book] @en
alternative label: obra monográfica @es
alternative label: livre @fr
narrower: поглавље у књизи
preferred label: boek @nl
alternative label: monographie @fr
preferred label: bog @da
alternative label: 图书 @zh
preferred label: bok @sv
preferred label: 도서 @ko
alternative label: 書 @zh
alternative label: افرودة @ar
broad match: Text
preferred label: knjiga
preferred label: carte @ro
alternative label: audiobook @en
alternative label: monograph @en
related match: Book
preferred label: könyv @hu
preferred label: βιβλίο @el
preferred label: llibre @ca
preferred label: kniha @cs
alternative label: 圖書 @zh
preferred label: Buch @de
preferred label: 书 @zh
alternative label: e-book @en
alternative label: 专著 @zh
alternative label: obra monografica @es
preferred label: كتاب @ar
preferred label: kirja @fi
narrow match: d4e2300
alternative label: monografie @cs
preferred label: книга @ru
preferred label: monografija
alternative label: books @en
preferred label: book @en
in scheme: Resource Types
type: Concept
preferred label: 図書 @ja
alternative label: Monographie @de
alternative label: монографија
alternative label: monografía @es
narrow match: BookReview
narrow match: BookChapter
preferred label: kitap @tr
preferred label: ouvrage @fr
alternative label: 專著 @zh

članak o skupu podataka
preferred label: artículo de datos @es
preferred label: document de date @ro
preferred label: article sur les données @fr
preferred label: article de dades @ca
preferred label: ورقة بيانات @ar
preferred label: 데이터 논문 @ko
preferred label: adatcikk @hu
preferred label: článek o datové sadě @cs
alternative label: članek o podatkovnem naboru @sl
preferred label: članek o podatkovni zbirki @sl
preferred label: άρθρο δεδομένων @el
alternative label: artículo de datos científicos @es
preferred label: veri makalesi @tr
alternative label: articulo de datos @es
preferred label: tutkimusaineistoa kuvaava artikkeli @fi
preferred label: data paper @en
type: Concept
in scheme: Resource Types
preferred label: 数据文章 @zh
alternative label: Forschungsdatenartikel @de
alternative label: опис скупа података
alternative label: articol de date @ro
broader: članak u časopisu
alternative label: 數據文章 @zh
alternative label: data descriptor @en
preferred label: データ論文 @ja
preferred label: artigo de dados @pt
definition: A data paper is a scholarly publication describing a particular dataset or group of dataset, published in the form of a peer-reviewed article in a scholarly journal. The main purpose of a data paper is to describe data, the circumstances of their collection, and information related to data features, access and potential reuse. Adapted from https://en.wikipedia.org/wiki/Data_paper and http://www.gbif.org/publishing-data/data-papers @en
preferred label: статья с цифровыми данными @ru
preferred label: Data Paper @de
preferred label: datadocumentatie @nl
alternative label: articulo de datos cientificos @es
preferred label: стаття у журналі даних @uk
alternative label: opis skupa podataka
preferred label: чланак о скупу података
preferred label: artigo de datos @gl

rezultat projekta
preferred label: project deliverable @en
alternative label: produto de projeto @pt
preferred label: projektrapport @sv
preferred label: результат проекту @uk
alternative label: نتاجات مشروع @ar
alternative label: risultato di progetto @it
alternative label: livrabilele proiectului @ro
type: Concept
alternative label: livrable de projet @fr
preferred label: livrable @fr
preferred label: proje çıktısı @tr
preferred label: резултат пројекта
preferred label: hankkeen suorite @fi
preferred label: 项目可交付成果 @zh
definition: A document containing a project report, intended to be delivered to a customer or funding agency describing the results achieved within a specific project. [Source: https://sparontologies.github.io/fabio/current/fabio.html#d4e5183] @en
alternative label: projekt resultat @da
preferred label: výstup projektu @cs
in scheme: Resource Types
broad match: Report
preferred label: entrega de projecte @ca
alternative label: resultado de projeto @pt
preferred label: Ergebnis im Projekt @de
preferred label: livrabilul proiectului @ro
broader: извештај
preferred label: entregable de proxecto @gl
preferred label: entregável de projeto @pt
alternative label: recensão @pt
preferred label: izdelek projekta @sl
preferred label: تسليمات مشروع @ar
preferred label: entregable de proyecto @es
alternative label: memoria de proyecto @es
preferred label: projekteredmény @hu
preferred label: deliverable di progetto @it
preferred label: результат проекта @ru
preferred label: プロジェクト報告書 @ja
alternative label: 項目可交付成果 @zh
broad match: d4e5183
alternative label: informes de projectes @ca
preferred label: παραδοτέο έργου @el
editorial note: Published @en
preferred label: projectresultaat @nl

софтвер за науку
alternative label: istraživački softver
alternative label: soft de cercetare @ro
alternative label: научни софтвер
preferred label: forskningssoftware @da
preferred label: tutkimusohjelmisto @fi
definition: Software that is used to generate, process or analyse results that you intend to appear in a publication (either in a journal, conference paper, monograph, book or thesis). Research software can be anything from a few lines of code written by yourself, to a professionally developed software package. [Source: https://datashare.ed.ac.uk/handle/10283/785] @en
preferred label: software de investigación @gl
preferred label: forskningsprogramvara @sv
preferred label: 研究用ソフトウェア @ja
alternative label: programari d’anàlisi @ca
preferred label: 연구용소프트웨어 @ko
preferred label: research software @en
broad match: Software
broader: рачунарски програм
alternative label: programari per recerca @ca
preferred label: 研究软件 @zh
alternative label: forskningsmjukvara @sv
preferred label: برمجيات بحثية @ar
alternative label: naučni softver
preferred label: raziskovalna programska oprema @sl
preferred label: Forschungssoftware @de
editorial note: Published @en
preferred label: softver za nauku
preferred label: onderzoekssoftware @nl
alternative label: برمجيات بحث @ar
type: Concept
preferred label: Araştırma yazılımı @tr
preferred label: software de cercetare @ro
preferred label: ερευνητικό λογισμικό @el
preferred label: дослідницьке програмне забезпечення @uk
alternative label: program de cercetare @ro
preferred label: kutatási szoftver @hu
preferred label: programari acadèmic @ca
preferred label: исследовательское программное обеспечение @ru
in scheme: Resource Types
alternative label: истраживачки софтвер
preferred label: software di ricerca @it
alternative label: tutkimussovellus @fi
preferred label: logiciel de recherche @fr

snimljeni podaci
preferred label: date înregistrate @ro
alternative label: opgenomen data @nl
alternative label: datos grabados @es
related match: http://vocabs.lter-europe.net/elter_cl/10021
preferred label: aufgezeichnete Daten @de
preferred label: 기록 데이터 @ko
in scheme: Resource Types
preferred label: rögzített adatok @hu
type: Concept
preferred label: dados registados @pt
preferred label: datos rexistrados @gl
alternative label: zabeleženi podatki @sl
broad match: Dataset
preferred label: recorded data @en
alternative label: geregistreerde gegevens @nl
preferred label: posneti podatki @sl
preferred label: vastgelegde data @nl
preferred label: datos registrados @es
preferred label: dades enregistrades @ca
preferred label: tallennettu data @fi
preferred label: optaget data @da
preferred label: 記録データ @ja
preferred label: donnée enregistrée @fr
definition: Data registered by mechanical or electronic means, in a form that allows the information to be retrieved and/or reproduced. For example, images or sounds on disc or magnetic tape. [Source: Adapted from https://ddialliance.org/Specification/DDI-CV/ModeOfCollection_3.0.html] @en
preferred label: dati registrati @it
preferred label: записанные данные @ru
preferred label: снимљени подаци
preferred label: kayıtlı veri @tr
preferred label: بيانات مسجلة @ar
preferred label: καταγεγραμμένα δεδομένα @el
preferred label: 记录数据 @zh
broader: скуп података
preferred label: зафіксовані дані @uk

patentna prijava
preferred label: demande PCT @fr
in scheme: Resource Types
preferred label: Internationale Patentanmeldung @de
type: Concept
alternative label: tractat de cooperació en materia de patents @ca
alternative label: Patent İşbirliği Anlaşması başvurusu @tr
alternative label: cerere de brevet internaţional @ro
preferred label: kansainvälinen patenttihakemus @fi
preferred label: αίτηση PCT (Συνθήκη συνεργασίας για διπλώματα Ευρεσυτεχνίας) @el
preferred label: Заявка РСТ @ru
preferred label: Pedido PCT @pt
preferred label: PCT bejelentési kérelem @hu
definition: A patent application filed through the WIPO-administered Patent Cooperation Treaty (PCT), also known as an international application. [Source: Adapted from https://www.wipo.int/edocs/pubdocs/en/wipo_pub_943_2018.pdf] @en
preferred label: PCT @es
preferred label: PCT-ansøgning @da
preferred label: міжнародна заявка на винахід (РСТ) @uk
preferred label: PCT出願 @ja
preferred label: cerere PCT @ro
preferred label: PCT application @en
preferred label: طلب خاص بمعاهدة التعاون بشأن البراءات @ar
preferred label: domanda internazionale di brevetto @it
preferred label: PCT 출원 @ko
preferred label: 国际专利合作条约PCT申请 @zh
preferred label: PCT başvurusu @tr
alternative label: aplicació del PCT @ca
alternative label: solicitude PCT @gl
preferred label: PCT-ansökan @sv
preferred label: патентна пријава
broader: patent
preferred label: PCT-aanvraag @nl

zaštitni znak
alternative label: marca registada @pt
preferred label: logo @ca
preferred label: marque déposée @fr
preferred label: tavaramerkki @fi
preferred label: marchio depositato @it
in scheme: Resource Types
preferred label: blagovna znamka @sl
preferred label: varumärke @sv
preferred label: trademark @en
preferred label: márka @hu
type: Concept
preferred label: علامة تجارية @ar
preferred label: εμπορικό σήμα @el
preferred label: 商標 @ja
preferred label: 商标 @zh
preferred label: ticari marka @tr
preferred label: торгова марка @uk
preferred label: marca @pt
preferred label: 상표 @ko
preferred label: заштитни знак
top concept of: Resource Types
alternative label: símbol @ca
related match: D010330
preferred label: handelsmerk @nl
alternative label: marque commerciale @fr
preferred label: varemærke @da
preferred label: Warenzeichen @de
preferred label: marcă @ro
definition: A sign used to distinguish the goods or services of one undertaking from those of others. A trademark may consist of words and combinations of words (for instance, names or slogans), logos, figures and images, letters, numbers, sounds, or, in rare instances, smells or moving images, or a combination thereof. [Source: https://www.wipo.int/trademarks/en] @en
alternative label: logosímbol @ca
preferred label: торговая марка @ru

дизајн
preferred label: дизайн @ru
preferred label: deseño @gl
preferred label: 디자인 @ko
narrower: схема конфигурације
narrower: индустријски дизајн
preferred label: formgivning @da
preferred label: dizajn
preferred label: ontwerp @nl
definition: Plans, drawing or set of drawings showing how something e.g. building, product is to be made and how it will work and look. [Source: Adapted from https://dictionary.cambridge.org/dictionary/english/design] @en
preferred label: design @en
preferred label: schéma @fr
preferred label: diseño @es
preferred label: Entwurf @de
preferred label: proiectare @ro
preferred label: suunnitelma @fi
in scheme: Resource Types
type: Concept
preferred label: تصميم @ar
preferred label: tervrajz @hu
preferred label: oblikovanje @sl
preferred label: desenho @pt
preferred label: tasarım @tr
preferred label: disseny @ca
preferred label: デザイン @ja
top concept of: Resource Types
preferred label: σχεδίαση @el
preferred label: 设计 @zh

Teilbericht
preferred label: part d'un informe @ca
in scheme: Resource Types
preferred label: 報告書（部分） @ja
alternative label: parte de relatório @pt
alternative label: rapportdeel @nl
alternative label: parte de una relación @es
broad match: Report
alternative label: parte de una relacion @es
preferred label: deelrapport @nl
preferred label: capitolo di rapporto tecnico @it
preferred label: 报告部分 @zh
alternative label: parte de un informe @es
expires: 2021-03-12
top concept of: Resource Types
alternative label: 報告部分 @zh
preferred label: capítulo de relatório @pt
alternative label: reportPart @en
preferred label: chapitre de rapport @fr
preferred label: parte de un estudio @es
alternative label: partie de rapport @fr
definition: part of a report @en
preferred label: rapor bölümü @tr
preferred label: report part @en
editorial note: Deprecated @en
type: Concept

konferencijski prilog
narrower: neobjavljen poster sa konferencije
preferred label: contribución de congreso @es
narrower: зборник саопштења са конференције
preferred label: 회의자료 @ko
preferred label: επιστημονική παραγωγή συνεδρίου @el
preferred label: documento de conferência @pt
preferred label: konferencia anyagok @hu
preferred label: contribució a congrés @ca
preferred label: 会议对象 @zh
preferred label: risultato di convegno @it
alternative label: materiale din conferință @ro
definition: All kind of digital resources contributed to a conference, like conference presentation (slides), conference report, conference lecture, abstracts, demonstrations. For conference papers, posters or proceedings the specific sub-concepts should be used. [COAR definition] @en
preferred label: конференцијски прилог
broad match: Event
alternative label: نتاج مؤتمر @ar
alternative label: materiale folosite la conferință @ro
type: Concept
preferred label: conferentie bijdrage @nl
preferred label: rezultat na konferenci @sl
narrower: neobjavljeno saopštenje sa konferencije
preferred label: конференц-объект @ru
preferred label: materiale de conferință @ro
preferred label: contribución a congreso @gl
preferred label: матеріал конференції @uk
in scheme: Resource Types
preferred label: Konferenzveröffentlichung @de
preferred label: conference output @en
preferred label: 会議資料 @ja
preferred label: konferensbidrag @sv
preferred label: مخرج مؤتمر @ar
preferred label: konferans çıktısı @tr
narrower: презентација са конференције
broader: teksti
preferred label: objet présenté à une conférence @fr

заштићена биљна сорта
definition: Plant variety protection, also called a "plant breeder's right" (PBR), is a form of intellectual property right granted to the breeder of a new plant variety . According to this right, certain acts concerning the exploitation of the protected variety require the prior authorization of the breeder. Plant variety protection is an independent sui generis form of protection, tailored to protect new plant varieties and has certain features in common with other intellectual property rights. [Source: https://www.wipo.int/edocs/pubdocs/en/wipo_pub_943_2018.pdf] @en
preferred label: kasvinjalostajanoikeus @fi
preferred label: protecția soiurilor de plante @ro
alternative label: Pflanzensortenschutz @de
preferred label: захист сортів рослин @uk
preferred label: plant variety protection @en
preferred label: حماية الأصناف النباتية @ar
preferred label: охрана новых сортов растений @ru
preferred label: zaštićena biljna sorta
preferred label: plante nyheds beskyttelses @da
alternative label: obtenció de les varietats vegetals @ca
preferred label: bitki çeşitliliğini koruma @tr
preferred label: žlahniteljska pravica @sl
preferred label: proteção de variedades vegetais @pt
preferred label: plantenras bescherming @nl
preferred label: privativa di varietà vegetale @it
preferred label: växtförädlarrätt @sv
preferred label: protección de variedades vexetais @gl
preferred label: protecció de les varietats vegetals @ca
broader: patent
preferred label: Sortenschutz @de
preferred label: 식물품종보호권 @ko
preferred label: προστασία φυτικών ποικιλιών @el
preferred label: certificat d'obtention végétale @fr
type: Concept
preferred label: obtención de variedades vegetales @es
in scheme: Resource Types
preferred label: növényfajta-oltalom @hu
preferred label: 育成者権 @ja
alternative label: COB @fr
preferred label: 植物新品种保护 @zh

интерактивна грађа
preferred label: recurs interactiu @ca
alternative label: 交互式资源 @zh
narrower: veb-sajt
preferred label: ressource interactive @fr
alternative label: مورد تفاعلي @ar
preferred label: インタラクティブリソース @ja
preferred label: интерактивный ресурс @ru
alternative label: 互動資源 @zh
in scheme: Resource Types
type: Concept
alternative label: interaktivni resurs
definition: A resource requiring interaction from the user to be understood, executed, or experienced. Examples include forms on Web pages, applets, multimedia learning objects, chat services, or virtual reality environments. Source: http://purl.org/dc/dcmitype/InteractiveResource @en
preferred label: interactive resource @en
preferred label: interaktív forrás @hu
preferred label: interaktiivinen resurssi @fi
alternative label: contributo a convegno @it
preferred label: مصدر تفاعلي @ar
preferred label: recurso interativo @pt
preferred label: interaktiv resurs @sv
preferred label: інтерактивний ресурс @uk
alternative label: interaktivni vir @sl
alternative label: 交互式資源 @zh
preferred label: interactieve bron @nl
alternative label: interaktiv ressource @da
preferred label: risorsa interattiva @it
alternative label: интерактивни ресурс
preferred label: interaktive Ressource @de
preferred label: interaktivna građa
preferred label: recurso interactivo @es
top concept of: Resource Types
preferred label: etkileşimli kaynak @tr
preferred label: 互动资源 @zh
preferred label: interaktivní zdroj @cs
preferred label: interaktivt materiale @da
preferred label: resursă interactivă @ro
preferred label: 인터렉티브 리소스 @ko

pregledni članak
preferred label: article de synthèse @fr
preferred label: overzichtsartikel @nl
editorial note: Published @en
alternative label: articulo de reseña @es
alternative label: 综述 @zh
preferred label: szakirodalmi áttekintő cikk @hu
preferred label: översiktsartikel @sv
preferred label: 综述文章 @zh
preferred label: Übersichtsartikel @de
broad match: Article
preferred label: review article @en
in scheme: Resource Types
type: Concept
broad match: d4e5310
preferred label: 리뷰 논문 @ko
preferred label: litteraturgennemgang @da
preferred label: artigo de revisión @gl
preferred label: مقال مراجعة @ar
alternative label: recensie-artikel @nl
broader: članak u časopisu
alternative label: 综述论文 @zh
preferred label: άρθρο κριτικής @el
alternative label: articulo de revision @es
alternative label: articol de analiză @ro
alternative label: прегледни научни чланак
preferred label: katsausartikkeli @fi
preferred label: обзорная статья @ru
preferred label: artigo de revisão @pt
preferred label: прегледни чланак
preferred label: оглядова стаття @uk
alternative label: pregledni rad
alternative label: artículo de reseña @es
alternative label: 综述评论性论文 @zh
preferred label: derleme makale @tr
preferred label: articol de reviziune @ro
alternative label: прегледни рад
alternative label: 综述评论性文章 @zh
broad match: JournalArticle
preferred label: レビュー論文 @ja
preferred label: artículo de revisión @es
preferred label: přehledový článek @cs
narrow match: D016454
preferred label: pregledni znanstveni članek @sl
alternative label: article de revisió @ca
alternative label: pregledni naučni članak
definition: A review article is a secondary source, that is, it is written about other articles, and does not report original research of its own. [Source: Adapted from http://apus.libanswers.com/faq/2324] @en

клиничка студија
preferred label: klinische studie @nl
preferred label: studio clinico @it
preferred label: clinical study @en
preferred label: étude clinique @fr
related match: d4e2502
preferred label: estudo clínico @pt
preferred label: klinische Studie @de
preferred label: estudio clínico @es
preferred label: 臨床研究 @ja
preferred label: studiu clinic @ro
preferred label: клінічне дослідження @uk
preferred label: Klinik çalışması @tr
preferred label: kliininen tutkimus @fi
editorial note: Published @en
alternative label: essai clinique @fr
alternative label: klinisch onderzoek @nl
preferred label: estudi clínic @ca
alternative label: ensaio clínico @pt
preferred label: klinikai vizsgálat @hu
definition: A work that reports on the results of a research study to evaluate interventions or exposures on biomedical or health-related outcomes. The two main types of clinical studies are interventional studies (clinical trials) and observational studies. While most clinical studies concern humans, this publication type may be used for clinical veterinary articles meeting the requisites for humans. [Source: https://www.ncbi.nlm.nih.gov/mesh/2009830] @en
preferred label: klinična študija @sl
in scheme: Resource Types
preferred label: klinisk rapport @da
broad match: studyregistration
broader: извештај
preferred label: دراسة سريرية @ar
type: Concept
preferred label: клиническое исследование @ru
preferred label: 临床研究 @zh
preferred label: klinisk studie @sv
preferred label: κλινική μελέτη @el
preferred label: 임상 연구 @ko
preferred label: klinička studija

новински чланак
preferred label: sanomalehtiartikkeli @fi
preferred label: artículo de periódico @es
preferred label: άρθρο εφημερίδας @el
broad match: Article
preferred label: újságcikk @hu
definition: Work consisting of a news item appearing in a general-interest newspaper or other general news periodical, containing information of current and timely interest in a field. (Adapted from http://www.reference.md/files/D018/mD018431.html ) @en
preferred label: krantenartikel @nl
preferred label: köşe yazısı @tr
preferred label: artigo de periódico @gl
alternative label: članak u novinama
preferred label: Zeitungsartikel @de
alternative label: чланак у новинама
editorial note: Published @en
preferred label: članek v časopisu @sl
alternative label: artículo de diario @es
preferred label: avisartikel @da
preferred label: 新聞記事 @ja
preferred label: article de diari @ca
preferred label: газетная статья @ru
alternative label: article de periòdic @ca
type: Concept
alternative label: Gazete yazısı @tr
preferred label: artigo de jornal @pt
preferred label: стаття в газеті @uk
alternative label: articulo de diario @es
in scheme: Resource Types
preferred label: newspaper article @en
broader: novine
preferred label: articolo di giornale @it
preferred label: articol de ziar @ro
preferred label: artikel i dags-/nyhetstidning @sv
preferred label: مقال في صحيفة @ar
alternative label: articulo de periodico @es
preferred label: novinski članak
preferred label: 报纸文章 @zh
preferred label: article de journal @fr

мапа
preferred label: kartta @fi
preferred label: mappa @it
alternative label: kort @da
alternative label: geografska karta
preferred label: خارطة @ar
preferred label: zemljevid @sl
preferred label: карта @ru
in scheme: Resource Types
preferred label: 지도 @ko
preferred label: mapa
preferred label: map @en
alternative label: план @ru
type: Concept
definition: harita @tr
alternative label: landskabskort @da
preferred label: Karte @de
alternative label: отображение @ru
alternative label: географска карта
preferred label: harita @tr
preferred label: 地図 @ja
preferred label: karta @sv
alternative label: чертёж @ru
preferred label: landkort @da
broader: картографска грађа
preferred label: χάρτης @el
preferred label: 地图 @zh
preferred label: hartă @ro
definition: Defined as a representation normally to scale and on a flat medium, of a selection of material or abstract features on, or in relation to, the surface of the earth or of another celestial body. [Source: https://www.loc.gov/marc/bibliographic/bd007a.html] @en
alternative label: 地圖 @zh
preferred label: kaart @nl
alternative label: plan @fr
preferred label: térkép @hu
preferred label: carte géographique @fr
editorial note: Published @en

картографска грађа
preferred label: kartografik materyal @tr
preferred label: kartografiske materialer @da
broad match: Map
top concept of: Resource Types
preferred label: kartografiskt material @sv
preferred label: kartografsko gradivo @sl
alternative label: картографски материјал
preferred label: material cartográfico @pt
preferred label: 地図資料 @ja
alternative label: kartografski materijal
preferred label: картографический материал @ru
alternative label: material cartografico @es
preferred label: kartografska građa
preferred label: χαρτογραφικό υλικό @el
preferred label: kartografinen aineisto @fi
preferred label: 지도자료 @ko
editorial note: Published @en
definition: Any material representing the whole or part of the earth or any celestial body at any scale. Cartographic materials include two- and three-dimensional maps and plans (including maps of imaginary places); aeronautical, navigational, and celestial charts; atlases; globes; block diagrams; sections; aerial photographs with a cartographic purpose; bird's-eye views (map views), etc. [Source: http://www.loc.gov/marc/cfmap.html] @en
preferred label: matériel cartographique @fr
preferred label: картографічний матеріал @uk
type: Concept
preferred label: kartographisches Material @de
preferred label: kartografický dokument @cs
preferred label: 地图类资料 @zh
preferred label: cartografia @it
preferred label: térképészeti anyag @hu
alternative label: kartografski material @sl
preferred label: cartografisch materiaal @nl
in scheme: Resource Types
narrower: мапа
preferred label: cartographic material @en
alternative label: 地圖類資料 @zh
preferred label: material cartogràfic @ca
preferred label: material cartografic @ro
alternative label: materiale cartografico @it
preferred label: مادة خرائطية @ar

pismo
preferred label: 短報 @ja
preferred label: kirje @fi
preferred label: Brief @de
alternative label: Korrespondenz @de
alternative label: polemika @sl
alternative label: Leserbrief @de
preferred label: brief @nl
in scheme: Resource Types
preferred label: carta @pt
type: Concept
preferred label: dopis @cs
preferred label: письмо @ru
preferred label: comunicazione @it
preferred label: писмо
preferred label: lettre @fr
preferred label: levél @hu
preferred label: лист @uk
preferred label: mektup @tr
narrow match: D019531
alternative label: dikusijski prispevek @sl
alternative label: 讀者來信 @zh
preferred label: scrisoare @ro
alternative label: missiva @pt
broader: teksti
preferred label: επιστολή @el
broad match: Text
preferred label: مراسلة @ar
alternative label: 读者来信 @zh
preferred label: brev @sv
alternative label: lettera @it
preferred label: 信 @zh
definition: A brief description of important new research, also known as “communication”. [Source: https://cerif.eurocris.org/vocab/html/OutputTypes.html#Letter] @en
preferred label: 편지 @ko
preferred label: letter @en

arhivska zbirka
preferred label: Archivsammlung @de
alternative label: archivio @it
preferred label: архівна колекція @uk
alternative label: fons @ca
preferred label: アーカイブコレクション @ja
alternative label: collection d'archives @fr
broader: збирка
broad match: Collection
preferred label: colección de archivo @es
preferred label: 아카이브 컬렉션 @ko
preferred label: مجموعة أرشيفية @ar
preferred label: αρχειακή συλλογή @el
editorial note: New concept included for version 4 of resource type Vocab @en
definition: A collection of historical records and primary source documents. Documents may be tangible or digital. Adapted from “archive (groupings)” in Getty AAT: https://www.getty.edu/vow/AATFullDisplay?find=maiolica&logic=AND&note=&subjectid=300375748 @en
alternative label: arhivska kolekcija
preferred label: arkivsamling @sv
alternative label: fondo @es
preferred label: 档案收藏 @zh
alternative label: fondo arquivístico @gl
preferred label: архивная коллекция @ru
preferred label: архивска збирка
preferred label: collezione archivistica @it
preferred label: fonds d'archives @fr
preferred label: colección arquivística @gl
preferred label: acervo arquivístico @pt
alternative label: coleção arquivística @pt
preferred label: archival collection @en
preferred label: archív állomány @hu
preferred label: col·lecció d'arxiu @ca
preferred label: colecţie arhivală @ro
in scheme: Resource Types
preferred label: arşiv koleksiyonu @tr
type: Concept

часопис
alternative label: научни часопис
preferred label: مجلة أكاديمية @ar
preferred label: wetenschappelijk tijdschrift @nl
preferred label: rivista @it
preferred label: revista científica @ca
definition: A journal is a serial publication devoted to disseminating original research and current developments on a subject. (Adapted from ODLIS) [Source: http://dspacecris.eurocris.org/cris/classcerif/classcerif00422] @en
preferred label: журнал @ru
preferred label: Zeitschrift @de
in scheme: Resource Types
preferred label: tidskrift @sv
preferred label: revista @es
preferred label: revue @fr
preferred label: 学术期刊 @zh
alternative label: pubblicazione periodica @it
preferred label: znanstvena revija @sl
preferred label: dergi @tr
alternative label: périodique @fr
preferred label: odborné periodikum @cs
type: Concept
alternative label: 學術期刊 @zh
narrower: писмо уреднику
alternative label: 学报 @zh
alternative label: revue scientifique @fr
alternative label: 學報 @zh
alternative label: odborný časopis @cs
alternative label: naučni časopis
narrow match: JournalArticle
alternative label: 科学期刊 @zh
preferred label: ακαδημαϊκό περιοδικό @el
alternative label: revista académica @pt
broader: teksti
preferred label: науковий журнал @uk
preferred label: tieteellinen kausijulkaisu @fi
preferred label: 学術雑誌 @ja
preferred label: revistă @ro
narrower: uvodnik
alternative label: 저널 @ko
narrower: članak u časopisu
broad match: Text
preferred label: tidsskrift @da
alternative label: 科學期刊 @zh
preferred label: journal @en
preferred label: časopis
alternative label: periódico @pt
preferred label: tudományos folyóirat @hu
preferred label: 학술지 @ko
alternative label: دورية علمية @ar

naučni članak
alternative label: originalni naučni rad
alternative label: публикация в научном журнале @ru
preferred label: 原著論文 @ja
preferred label: szakcikk @hu
preferred label: مقال بحثي @ar
in scheme: Resource Types
alternative label: оригинални научни рад
preferred label: artigo de investigación @gl
preferred label: 原创研究文章 @zh
alternative label: artículo de investigación @es
preferred label: znanstveni članek @sl
editorial note: Published @en
alternative label: articulo original @es
alternative label: مقالة بحثية @ar
alternative label: artigo de investigação @pt
preferred label: artículo original @es
alternative label: оригинални научни чланак
alternative label: исследовательская статья @ru
preferred label: научная статья @ru
broad match: Article
preferred label: наукова стаття @uk
preferred label: 원저 논문 @ko
type: Concept
preferred label: forskningsartikel @da
preferred label: ερευνητικό άρθρο @el
alternative label: article científic @ca
preferred label: araştırma makalesi @tr
broader: članak u časopisu
alternative label: originalni naučni članak
preferred label: původní článek @cs
definition: A research article is a primary source, that is, it reports the methods and results of an original study performed by the authors. (adapted from http://apus.libanswers.com/faq/2324) @en
preferred label: artigo original @pt
alternative label: artículo científico @es
preferred label: научни чланак
preferred label: onderzoeksartikel @nl
preferred label: tutkimusartikkeli @fi
preferred label: articol de cercetare @ro
preferred label: Forschungsartikel @de
preferred label: research article @en
alternative label: 原创研究论文 @zh
alternative label: artigo científico @pt
preferred label: article de recerca @ca
alternative label: 연구 논문 @ko
alternative label: articulo de investigacion @es
alternative label: article scientifique @fr
preferred label: article de recherche @fr
alternative label: articulo cientifico @es

članak u časopisu
alternative label: 文章 @zh
preferred label: Zeitschriftenaufsatz @de
related match: SubmittedJournalArticle
preferred label: článek v odborném časopisu @cs
in scheme: Resource Types
narrow match: D016428
type: Concept
alternative label: 期刊論文 @zh
preferred label: article de revista @ca
alternative label: 紀要論文 @ja
preferred label: dergi makalesi @tr
preferred label: članek v reviji @sl
alternative label: artículo revisado por pares @es
preferred label: tidsskriftartikel @da
alternative label: article científic @ca
preferred label: articol de revistă @ro
preferred label: folyóiratcikk @hu
alternative label: 記事 @ja
alternative label: 期刊文章 @zh
preferred label: article @fr
alternative label: article de périodique @fr
preferred label: artigo @pt
narrower: članak o skupu podataka
related match: JournalItem
alternative label: artículo científico @es
alternative label: papier @fr
preferred label: tidskriftsartikel @sv
narrower: naučni članak
alternative label: artigo em revista @pt
preferred label: wetenschappelijk artikel @nl
preferred label: 学術雑誌論文 @ja
alternative label: 學術論文 @zh
alternative label: rad u časopisu
alternative label: Wissenschaftlicher Artikel @de
alternative label: artigo científico @pt
preferred label: стаття у науковому журналі @uk
alternative label: 論文 @zh
alternative label: 저널 논문 @ko
alternative label: articulo @es
alternative label: рад у часопису
preferred label: άρθρο ακαδημαϊκού περιοδικού @el
broad match: Article
alternative label: 期刊论文 @zh
alternative label: artículo de revista @es
preferred label: 学术论文 @zh
alternative label: article revisat per parells @ca
preferred label: 학술지 논문 @ko
preferred label: journal article @en
alternative label: article scientifique @fr
alternative label: artikel i vetenskaplig tidskrift @sv
preferred label: tieteellinen artikkeli @fi
preferred label: مقال في مجلة أكاديمية @ar
preferred label: articolo de rivista @it
preferred label: журнальная статья @ru
alternative label: 论文 @zh
narrower: erratum
broader: часопис
alternative label: articulo cientifico @es
definition: An article, typically the realization of a research paper reporting original research findings, published in a journal issue. [Source: https://sparontologies.github.io/fabio/current/fabio.html#d4e3646] @en
narrower: pregledni članak
preferred label: чланак у часопису
alternative label: articolo @it
narrower: чланак о рачунарском програму
preferred label: artículo @es

презентација са конференције
preferred label: prezentare la conferinţă @ro
preferred label: apresentação em conferência @pt
broad match: http://purl.bioontology.org/ontology/SNOMEDCT/246105001
preferred label: 학술대회 발표자료 @ko
preferred label: konferencia-előadás diasora @hu
preferred label: support de présentation à une conférence @fr
preferred label: конференционная презентация @ru
preferred label: conferentie presentatie @nl
preferred label: 会议演示报告 @zh
alternative label: prezentare @ro
preferred label: presentació a congrés @ca
preferred label: conference presentation @en
preferred label: predstavitev na konferenci @sl
preferred label: презентація на конференції @uk
alternative label: presentació de conferència @ca
preferred label: عرض مؤتمر @ar
preferred label: 会議発表資料 @ja
definition: A set of slides containing text, tables or figures, designed to communicate ideas or research results, for projection and viewing by an audience at a conference, symposium, seminar, lecture, workshop or other gatherings. [Source: Adapted from hhttps://sparontologies.github.io/fabio/current/fabio.html#d4e4880] @en
alternative label: expunere @ro
preferred label: konferenspresentation @sv
broader: konferencijski prilog
preferred label: Konferenzpräsentation @de
type: Concept
preferred label: konferenssiesitelmä @fi
alternative label: presentació de comunicació @ca
in scheme: Resource Types
alternative label: apresentação @pt
alternative label: presentación @es
preferred label: presentazione a convegno @it
preferred label: prezentacija sa konferencije
preferred label: konferans sunumu @tr
preferred label: presentación de congreso @es
preferred label: konferencepræsentation @da
preferred label: παρουσίαση συνεδρίου @el

informativna revija
preferred label: revista divulgativa @es
preferred label: magasin @sv
preferred label: aikakauslehti @fi
in scheme: Resource Types
narrower: чланак у информативној ревији
preferred label: magazin
type: Concept
preferred label: Magazin @tr
preferred label: rivista divulgativa @it
preferred label: журнал @uk
preferred label: revista de divulgació @ca
alternative label: revista de divulgación científica @es
preferred label: magazine @fr
alternative label: магазин
preferred label: مجلة @ar
broader: teksti
preferred label: 雑誌 @ja
alternative label: revista de divulgacion @es
alternative label: revista de divulgacion cientifica @es
preferred label: 杂志 @zh
preferred label: 잡지 @ko
preferred label: revista de divulgação @pt
preferred label: периодическое печатное издание @ru
alternative label: časnik @sl
preferred label: tijdschrift @nl
alternative label: revista de divulgación @es
alternative label: revista informativa @pt
alternative label: Informationszeitschrift @de
editorial note: Published @en
definition: A popular interest periodical usually containing articles on a variety of topics, written by various authors in a nonscholarly style or a trade publication, unlike a consumer publication, covers a specific topic for people who work in that particular field or industry. [Source: Adapted from https://www.thebalance.com/what-is-a-trade-publication-exactly-2316039 and http://www.abc-clio.com/ODLIS/odlis_m.aspx] @en
alternative label: časopis @sl
preferred label: информативна ревија

геномски подаци
broad match: Dataset
preferred label: геномні дані @uk
preferred label: genomiska data @sv
preferred label: genomidata @fi
preferred label: γονιδιωματικά δεδομένα @el
type: Concept
preferred label: dades genòmiques @ca
preferred label: date genomice @ro
preferred label: genomikai adatok @hu
preferred label: datos genómicos @es
preferred label: genomik veri @tr
preferred label: геномные данные @ru
preferred label: dados genómicos @pt
in scheme: Resource Types
preferred label: 基因组数据 @zh
preferred label: genomic data @en
preferred label: genomiske data @da
preferred label: genomski podaci
preferred label: بيانات جينومية @ar
preferred label: genomski podatki @sl
preferred label: genomische data @nl
preferred label: donnée génomique @fr
preferred label: datos xenómicos @gl
preferred label: Genomdaten @de
broader: скуп података
preferred label: ゲノムデータ @ja
preferred label: 지놈 데이터 @ko
definition: Genomic data refers to the genome and DNA data of an organism. They are used in bioinformatics for collecting, storing and processing the genomes of living things. Genomic data is a more extensive term than sequencing data. However genomic data mostly come from sequencing techniques. It may include non-sequencing data such as data from microarrays, data from real-time PCR panels and data from pharmacogenomics studies. [Source: Adapted from https://www.techopedia.com/definition/31247/genomic-data] @en
preferred label: dati genomici @it

наставни материјал
preferred label: Lernobjekt @de
preferred label: навчальний об'єкт @uk
preferred label: leerobject @nl
preferred label: lärobjekt @sv
preferred label: Objeto de aprendizagem @pt
alternative label: وحدة تعليمية @ar
preferred label: obiect de învăţare @ro
preferred label: objecte d’aprenentatge @ca
definition: A resource requiring interaction from the user to be understood, executed, or experienced. Examples include forms on Web pages, applets, multimedia learning objects, chat services, or virtual reality environments. [Source: http://purl.org/dc/dcmitype/InteractiveResource] @en
top concept of: Resource Types
preferred label: объект обучения @ru
preferred label: nastavni materijal
alternative label: Kursmaterial @de
preferred label: 教材 @ja
editorial note: Published @en
preferred label: 교수학습자료 @ko
alternative label: odprti učni vir @sl
alternative label: مادة تعليمية @ar
alternative label: Lernunterlagen @de
alternative label: obiect de învăţământ @ro
preferred label: object d'apprentissage @fr
preferred label: tanulást támogató digitális eszköz @hu
preferred label: oppimateriaali @fi
broad match: InteractiveResource
type: Concept
preferred label: objeto de aprendizaje @es
preferred label: oggetto didattico @it
preferred label: učno gradivo @sl
preferred label: læringsobjekt @da
in scheme: Resource Types
preferred label: learning object @en
preferred label: كائن تعليمي @ar
preferred label: Öğrenim nesnesi @tr
preferred label: obxecto de aprendizaxe @gl

музичка композиција
alternative label: 音樂作品 @zh
alternative label: 音樂 @zh
preferred label: müzikal kompozisyon @tr
alternative label: قطعة موسيقية @ar
preferred label: musikalisk komposition @sv
preferred label: composition musicale @fr
definition: Musical composition can refer to an original piece of music, the structure of a musical piece, or the process of creating a new piece of music. [Source: https://en.wikipedia.org/wiki/Musical_composition ] @en
alternative label: obra de musica @es
editorial note: Published @en
preferred label: μουσική σύνθεση @el
preferred label: composizione musicale @it
preferred label: musical composition @en
in scheme: Resource Types
alternative label: Tonsatz @de
preferred label: 音楽 @ja
alternative label: 음악작품 @ko
preferred label: تأليف موسيقي @ar
preferred label: compoziţie muzicală @ro
type: Concept
alternative label: pieza musical @es
preferred label: 음악 @ko
preferred label: skladba @sl
alternative label: partitura @ca
alternative label: obra de música @es
alternative label: obra musical @es
preferred label: sävellys @fi
alternative label: pieza de música @es
alternative label: 音乐作品 @zh
preferred label: hudební skladba @cs
broader: звучни запис
alternative label: glasbeno delo @sl
alternative label: composicion musical @es
preferred label: composición musical @es
preferred label: muzička kompozicija
preferred label: zenei alkotás @hu
preferred label: 音乐 @zh
preferred label: composição musical @pt
preferred label: музичний твір @uk
preferred label: музыкальное произведение @ru
alternative label: komposition @da
preferred label: musikalische Komposition @de
preferred label: muzikale compositie @nl
preferred label: composició musical @ca
alternative label: hudební kompozice @cs
preferred label: musikværk @da
alternative label: pieza de musica @es

постер са конференције
alternative label: poster de conférence @fr
preferred label: 会議発表ポスター @ja
preferred label: 학술대회 포스터 @ko
definition: A display poster, published within a conference proceeding, typically containing text with illustrative figures and/or tables, usually reporting research results or proposing hypotheses, submitted for acceptance to and/or presented at a conference, seminar, symposium, workshop or similar event. [Source: Adapted https://sparontologies.github.io/fabio/current/fabio.html#d4e2648] @en
preferred label: konference plakat @da
preferred label: pòster de congrés @ca
preferred label: αφίσα συνεδρίου @el
alternative label: 會議牆報 @zh
alternative label: poster de congreso @es
alternative label: póster científico @es
alternative label: poster @it
alternative label: póster em congresso @pt
alternative label: konference poster @da
alternative label: 會議海報 @zh
preferred label: konferans posteri @tr
alternative label: póster @pt
type: Concept
preferred label: posteri @fi
preferred label: poster de conferinţă @ro
preferred label: conferentieposter @nl
preferred label: ملصق مؤتمر @ar
alternative label: poster cientifico @es
in scheme: Resource Types
alternative label: cartel @es
alternative label: 会议墙报 @zh
preferred label: konferensposter @sv
preferred label: 会议集里的会议海报/会议板报 @zh
broad match: Event
preferred label: konferencia poszter @hu
broader: зборник саопштења са конференције
alternative label: poster de congrès @fr
preferred label: poster in congresso @it
preferred label: póster de congreso @gl
preferred label: poster dans une conférence @fr
preferred label: Konferenzposter @de
preferred label: стендовый доклад @ru
preferred label: poster sa konferencije
preferred label: poster na konferenci @cs
preferred label: conference poster @en
preferred label: стендова доповідь @uk
preferred label: póster em conferência @pt

мастер/магистарска теза
broader: теза
preferred label: masteruppsats @sv
alternative label: rapport de master @fr
preferred label: treball final de màster @ca
alternative label: trabajo final de máster @es
preferred label: yüksek lisans tezi @tr
preferred label: dissertação de mestrado @pt
alternative label: specialeafhandling @da
preferred label: μεταπτυχιακή διατριβή @el
alternative label: trabajo final de posgrado @es
preferred label: diplomová práce @cs
alternative label: magistrska naloga @sl
alternative label: 硕士研究生毕业论文 @zh
preferred label: أطروحة ماجستير @ar
type: Concept
alternative label: tese de mestrado @pt
in scheme: Resource Types
alternative label: trabajo final de maestría @es
preferred label: teză de master @ro
alternative label: trabajo final de master @es
alternative label: 碩士學位論文 @zh
alternative label: tesis de maestria @es
alternative label: master dissertation @en
preferred label: speciale @da
alternative label: 碩士研究生畢業論文 @zh
preferred label: tesis de maestría @es
preferred label: maisterintutkielma @fi
definition: A thesis reporting a research project undertaken as part of a graduate course of education leading to a master's degree. [Source: https://sparontologies.github.io/fabio/current/fabio.html#d4e4057] @en
alternative label: мастер/магистарски рад
preferred label: 硕士学位论文 @zh
preferred label: master thesis @en
alternative label: tese de máster @gl
broad match: Thesis
preferred label: tesi di master @it
alternative label: tesina @ca
alternative label: master/magistarski rad
alternative label: treball de fi de postgrau @ca
alternative label: mémoire de maîtrise @fr
preferred label: mémoire de master @fr
preferred label: master/magistarska teza
preferred label: magistrsko delo @sl
preferred label: masterscriptie @nl
preferred label: магістерська робота @uk
preferred label: магистерская диссертация @ru
preferred label: traballo de fin de máster @gl
preferred label: 修士論文 @ja
preferred label: Abschlussarbeit (Master) @de
alternative label: rapport de maîtrise @fr
preferred label: 석사논문 @ko
preferred label: mesterszakos szakdolgozat @hu

mali patent
definition: A special form of patent right granted by a state or jurisdiction to an inventor or the inventor’s assignee for a fixed period of time. The terms and conditions for granting a utility model are slightly different from those for normal patents (including a shorter term of protection and less stringent patentability requirements). The term can also describe what are known in certain countries as “petty patents,” “short-term patents” or “innovation patents.” [Source: https://www.wipo.int/edocs/pubdocs/en/wipo_pub_943_2018.pdf] @en
preferred label: model de utilitate @ro
broad match: d4e4175
preferred label: utility model @en
preferred label: modelo de utilidade @pt
preferred label: használati minta @hu
preferred label: полезная модель @ru
preferred label: modèle d'utilité @fr
preferred label: 实用新型专利 @zh
preferred label: modelo de utilidad @es
preferred label: patent s skrajšanim trajanjem @sl
preferred label: modello di utilità @it
preferred label: Gebrauchsmuster @de
in scheme: Resource Types
preferred label: 実用新案 @ja
preferred label: мали патент
preferred label: نموذج منفعة @ar
preferred label: hyödyllisyysmalli @fi
preferred label: μοντέλο χρησιμότητας @el
type: Concept
preferred label: brugsmodel @da
broader: patent
preferred label: корисна модель @uk
preferred label: faydalı model @tr
preferred label: gebruiksmodel @nl
preferred label: 실용신안 @ko
preferred label: model d'utilitat @ca
preferred label: bruksmodell @sv

informativni prilog
preferred label: 学術雑誌掲載記事 @ja
preferred label: příspěvek v časopisu @cs
preferred label: مساهمة في دورية @ar
preferred label: contribution à un journal @fr
preferred label: contributo in rivista @it
in scheme: Resource Types
type: Concept
preferred label: Zeitschriftenbeitrag @de
preferred label: 期刊文献 @zh
alternative label: информативни прилог (у часопису)
alternative label: articulo de prensa @es
alternative label: artículo de boletín @es
preferred label: contribution to journal @en
preferred label: contribución a revista @es
alternative label: articulo de revista @es
alternative label: 期刊论文 @zh
expires: 2021-03-12
top concept of: Resource Types
definition: A contribution to a journal denotes a work published in a journal. If applicable sub-terms should be chosen. @en
preferred label: tijdschrift bijdrage @nl
alternative label: informativni prilog (u časopisu)
alternative label: 期刊文獻 @zh
alternative label: artículo de revista @es
preferred label: информативни прилог
alternative label: مقال في دورية @ar
preferred label: contribució a revista @ca
preferred label: prispevek v reviji @sl
preferred label: contributo em revista @pt
alternative label: artículo de prensa @es

radni proces
top concept of: Resource Types
preferred label: процес роботи @uk
preferred label: arbetslöde @sv
preferred label: procedura
preferred label: 工作流程 @zh
alternative label: flux opérationnel @fr
preferred label: fluxo de trabalho @pt
preferred label: workflow @nl
alternative label: flux de travail @fr
preferred label: flujo de trabajo @es
definition: A recorded sequence of connected steps, which may be automated, specifying a reliably repeatable sequence of operations to be undertaken when conducting a particular job, for example an in silico investigation that extracts and processes information from a number of bioinformatics databases. [Source: Adapted from https://sparontologies.github.io/fabio/current/fabio.html#d4e6123] @en
alternative label: cicle de treball @ca
preferred label: flux de treball @ca
preferred label: ροή εργασίας @el
preferred label: радни процес
preferred label: fluxo de traballo @gl
alternative label: flusso di lavoro @it
preferred label: flux de lucru @ro
in scheme: Resource Types
alternative label: процедура
type: Concept
preferred label: iş akışı @tr
preferred label: 워크플로우 @ko
preferred label: munkafolyamat leírása @hu
preferred label: ワークフロー @ja
preferred label: Workflow @de
preferred label: pracovní postup @cs
preferred label: рабочий процесс @ru
preferred label: delovni tok @sl
alternative label: Arbeitsablauf @de
preferred label: arbejdsgang @da
preferred label: työnkulku @fi
preferred label: flux de travaux @fr
preferred label: سير العمل @ar
alternative label: 工作流 @zh

извештај
alternative label: 调研报告 @zh
alternative label: reports @en
narrower: анализа политике
type: Concept
narrower: клиничка студија
preferred label: jelentés @hu
alternative label: 研究报告 @zh
narrower: rezultat projekta
narrower: tehnički izveštaj
alternative label: reporte @es
in scheme: Resource Types
preferred label: raport @ro
broader: teksti
alternative label: 報告 @zh
preferred label: Bericht @de
preferred label: raportti @fi
alternative label: relacion @es
alternative label: relación @es
preferred label: 報告書 @ja
preferred label: تقرير @ar
preferred label: rapport @fr
definition: A report is a separately published record of research findings, research still in progress, policy developments and events, or other technical findings, usually bearing a report number and sometimes a grant number assigned by the funding agency. Also, an official record of the activities of a committee or corporate entity, the proceedings of a government body, or an investigation by an agency, whether published or private, usually archived or submitted to a higher authority, voluntarily or under mandate. In a more general sense, any formal account of facts or information related to a specific event or phenomenon, sometimes given at regular intervals. [Source: http://lu.com/odlis/odlis_R.cfm#report ] @en
preferred label: report @en
narrower: plan upravljanja podacima
preferred label: zpráva @cs
narrower: memorandum
preferred label: informe @es
preferred label: rapporto @it
preferred label: rapor @tr
broad match: Text
alternative label: paper @en
narrower: извештај о истраживању
alternative label: referat @ro
alternative label: estudio @es
preferred label: relatório @pt
preferred label: poročilo @sl
alternative label: estudi @ca
narrower: protokol istraživanja
preferred label: 报告 @zh
preferred label: izveštaj
narrower: 知識統合プロトコル
preferred label: отчет @ru
preferred label: έκθεση @el
alternative label: 科研报告 @zh
alternative label: memoria @es
preferred label: звіт @uk
alternative label: estudo @gl

геопросторни подаци
preferred label: 地理空间数据 @zh
preferred label: coğrafi uzamsal veri @tr
preferred label: геопросторові дані @uk
broad match: Dataset
preferred label: térinformációs adatok @hu
definition: Geospatial data are any type of data with spatial coordinates that allow them to be mapped to the Earth's surface. They can represent physical objects, discrete areas or continuous surfaces. Discrete geospatial data are usually represented using vector data consisting of points, lines and polygons, while continuous geospatial data are usually represented by raster data, consisting of a grid of cells that each has its own value. Any number of applications in a wide range of areas produce geospatial data, such as GIS, Remote Sensing equipment, GPS units, archaeological total stations, manual mapping and computer-aided design (CAD), in a number of formats, including images, vector, text, and tabular data. Vector-based geospatial data include tables listing archaeological sites along with their coordinates, text-based files (e.g., XML) containing coordinates and topology for historic road networks, voting figures for political parties by administrative area. Raster-based geospatial data include satellite images, aerial photographs, scanned maps, and digital maps of elevations, vegetation, land-use, sea surface temperatures, air pollution, soil-types, etc. [Source: https://ddialliance.org/Specification/DDI-CV/GeneralDataFormat_2.0.html] @en
in scheme: Resource Types
preferred label: dados geoespaciais @pt
alternative label: jeo uzamsal veri @tr
preferred label: геопространственные данные @ru
alternative label: prostorni podaci
related match: SALMON_00000675
preferred label: datos xeoespaciais @gl
type: Concept
preferred label: geospatial data @en
preferred label: donnée géospatiale @fr
preferred label: geospatiale gegevens @nl
preferred label: Geodaten @de
preferred label: geoprostorni podaci
preferred label: geoprostorski podatki @sl
alternative label: dades geogràfiques @ca
alternative label: просторни подаци
preferred label: dades geoespacials @ca
preferred label: 地理空間データ @ja
preferred label: geospatiala data @sv
alternative label: locatie data @nl
related match: D005842
preferred label: 지리공간 데이터 @ko
preferred label: datos geoespaciales @es
preferred label: γεωχωρικά δεδομένα @el
preferred label: dati geospaziali @it
broader: скуп података
preferred label: date geospațiale @ro
preferred label: geospatiale data @da
preferred label: بيانات جغرافية @ar
preferred label: paikkatieto @fi

анализа политике
preferred label: informe de política @ca
preferred label: strateško poročilo @sl
preferred label: szakpolitikai jelentés @hu
preferred label: informativa politica @it
preferred label: έκθεση πολιτικής @el
preferred label: memoria de actuación @es
alternative label: informe de gestión @es
alternative label: memoria de protocolo de actuación @es
preferred label: rapport stratégique @fr
preferred label: relatório de política @pt
preferred label: raport de politică @ro
preferred label: informe de situación @gl
alternative label: Strategiepapier @de
alternative label: 政策報告 @zh
definition: A policy report presents what is known about a particular issue or problem. It assembles facts and evidence to help readers understand complex issues and form a response. It might aim to be neutral, or it might aim to persuade readers in a particular direction. [Source: https://www.uow.edu.au/student/learning-co-op/assessments/policy-report/#] @en
preferred label: policy report @en
preferred label: zpráva k politice nebo strategii @cs
preferred label: politik rapport @da
preferred label: beleidsrapport @nl
preferred label: звіт з питань політики @uk
preferred label: Policy Report @de
alternative label: informe de gestió @ca
broad match: Report
preferred label: politiikkaraportti @fi
alternative label: informe sobre políticas @es
preferred label: policyrapport @sv
preferred label: politika raporu @tr
alternative label: informe de actuación @es
broader: извештај
type: Concept
preferred label: analiza politike
preferred label: تقرير سياسات @ar
preferred label: ポリシーレポート @ja
in scheme: Resource Types
alternative label: Grundsatzpapier @de
preferred label: 政策报告 @zh
preferred label: отчет о политике @ru
editorial note: Deprecated @en

komentar
preferred label: comentario @es
in scheme: Resource Types
type: Concept
preferred label: comentário @pl
preferred label: kommentár @hu
preferred label: commentario @it
preferred label: комментарий @pt
preferred label: تعليق @ar
preferred label: коментар
preferred label: kommentar @da
preferred label: σχολιασμός @el
preferred label: comentariu @ro
preferred label: commentary @en
preferred label: commentaar @nl
preferred label: commentaire @fr
preferred label: 논평 @ko
alternative label: değerlendirme @tr
preferred label: yorum @tr
broad match: d4e2568
preferred label: 論評 @ja
preferred label: opinió @ca
preferred label: Kommentar @de
alternative label: comentari @ca
broader: prikaz
preferred label: kritiikki @fi
preferred label: 评注 @zh
definition: A commentary is a more in-depth analysis written to draw attention to a work already published. Commentaries are somewhat like “reviews” in that the author presents his or her analysis of a work and why it would be of interest to a specific audience. [Source: https://www.enago.com/academy/perspective-opinion-and-commentary-pieces] @en

sistem organizacije znanja
in scheme: Resource Types
alternative label: sistema organizzativo del sapere @it
preferred label: sistema para la organización del conocimiento @es
narrow match: d4e5735
alternative label: sistema para a organización do coñecemento @gl
preferred label: sistema d'organització del coneixement @ca
preferred label: tudásszervezési rendszerek @hu
definition: All types of schemes for organizing information and promoting knowledge management. Knowledge organization systems include classification schemes that organize materials at a general level (such as books on a shelf), subject headings that provide more detailed access, and authority files that control variant versions of key information (such as geographic names and personal names). They also include less-traditional schemes, such as semantic artifacts, semantic networks and ontologies. https://www.clir.org/pubs/reports/pub91/1knowledge/ @en
preferred label: Wissensorganisationssystem @de
narrow match: d4e5828
preferred label: vidensorganisationssystem @da
preferred label: bilgi organizasyon sistemi @tr
preferred label: 知識組織化体系 @ja
preferred label: système d'organisation des connaissances @fr
preferred label: sistem de organizare a cunoștinței @ro
top concept of: Resource Types
editorial note: New concept included for upcoming version 4.0 @en
preferred label: σύστημα οργάνωσης γνώσης @el
preferred label: sistema de organização do conhecimento @pt
narrow match: https://bioportal.bioontology.org/ontologies/MESH
preferred label: نظام تنظيم المعرفة @ar
preferred label: систем организације знања
preferred label: sistema de organización do coñecemento @gl
preferred label: kunskapsorganisationssystem @sv
preferred label: система организации знаний @ru
preferred label: knowledge organization system @en
narrow match: d4e5645
preferred label: 지식조직체계 @ko
alternative label: sistema de organización del conocimiento @es
alternative label: système d'organisation de la connaissance @fr
preferred label: sistem za organizacijo znanja @sl
narrow match: controlledVocabulary
preferred label: система організації знання @uk
type: Concept
preferred label: sistema di organizzazione della conoscenza @it

patentirana sorta
in scheme: Resource Types
preferred label: πατέντα φυτών @el
preferred label: patent de plantes @ca
preferred label: Pflanzenpatent @de
preferred label: patente de plantas @es
preferred label: 植物特許 @ja
preferred label: 品种专属权 @zh
preferred label: växtpatent @sv
preferred label: plante patent @da
definition: A patent granted to anyone who has invented or discovered and asexually reproduced any distinct and new variety of plant, including cultivated sports, mutants, hybrids, and newly found seedlings, other than a tuber-propagated plant or a plant found in an uncultivated state. [Source: Adapted from https://www.uspto.gov/patents/basics/types-patent-applications/general-information-about-35-usc-161#heading-1] @en
preferred label: 식물 특허 @ko
preferred label: патентирана биљна сорта
preferred label: براءة اختراع نبات @ar
preferred label: патент на сорт рослин @uk
preferred label: патент на растение @ru
broad match: C43358
alternative label: brevet pentru soi @ro
alternative label: биљни патент
preferred label: brevet pentru plantă @ro
alternative label: brevet végétal @fr
preferred label: növényszabadalom @hu
preferred label: kwekersrecht @nl
preferred label: plant patent @en
preferred label: bitki patenti @tr
broad match: d4e4551
preferred label: kasvinjalostepatentti @fi
preferred label: rastlinska sorta @sl
broader: patent
preferred label: brevetto di pianta @it
type: Concept
preferred label: brevet de plante @fr

interview
preferred label: Görüşme @tr
expires: 2021-03-12
top concept of: Resource Types
alternative label: interviu @ca
alternative label: Mülakat @tr
definition: A discussion between a reporter, host, panel, or audience and a newsmaker, author, or celebrity, recorded (edited or unedited) in print, on film or video, as transcript or as a sound recording. (Adapted from ODLIS) @en
editorial note: Published @en
preferred label: entrevista @ca
preferred label: intervista @it
narrow match: Text Interview
type: Concept
alternative label: Röportaj @tr
in scheme: Resource Types
preferred label: Interview @de
narrow match: interview
preferred label: インタビュー @ja
preferred label: intervju @sl
narrow match: Broadcast Interview

research data
top concept of: Resource Types
in scheme: Resource Types
type: Concept
definition: Data that are used as primary sources to support technical or scientific enquiry, research, scholarship, or artistic activity, and that are used as evidence in the research process and/or are commonly accepted in the research community as necessary to validate research findings and results. [Source: https://casrai.org/term/research-data] @en
expires: 2021-04-01

Testcoll
type: Collection
preferred label: Testcoll-de @de