диссертация на соискание учёной степени
preferred label: doktorska disertacija @sl
broad match: Thesis
alternative label: 博士研究生毕业文论 @zh
type: Concept
alternative label: диссертация кандидата наук
preferred label: doctoral thesis @en
broader: Thesis
preferred label: tesi doctoral @ca
preferred label: tesi di dottorato @it
preferred label: doktora tezi @tr
alternative label: диссертация доктора наук
in scheme: Resource Types
alternative label: doktorsko delo @sl
alternative label: 博士研究生畢業論文 @zh
broader: научно-исследовательская работа
modified: 2019-04-11T22:51:07+00:00
alternative label: اطروحة @ar
alternative label: mémoire de thèse de doctorat @fr
alternative label: doktorská práce @cs
definition: A thesis reporting the research undertaken during a period of graduate study leading to a doctoral degree. @en
preferred label: اطروحة دكتوراه @ar
alternative label: dissertatie @nl
preferred label: thèse de doctorat @fr
alternative label: докторская диссертация
alternative label: 博士學位論文 @zh
alternative label: dissertation @en
preferred label: 博士学位论文 @zh
preferred label: tesis doctoral @es
preferred label: Dissertation oder Habilitation @de
preferred label: proefschrift @nl
preferred label: 博士論文 @ja
alternative label: tesis de doctorado @es
alternative label: диссертации на соискание учёной степени
preferred label: disertační práce @cs
preferred label: tese de doutoramento @pt
alternative label: PhD Thesis @en
alternative label: rapport de thèse de doctorat @fr

журнальная статья
alternative label: article científic @ca
alternative label: 學術論文 @zh
alternative label: публикации
alternative label: публикация
preferred label: article @fr
alternative label: articulo @es
alternative label: публикация данных
narrower: научная статья
preferred label: 学術雑誌論文 @ja
alternative label: departmental bulletin paper @en
alternative label: artículo científico @es
alternative label: 紀要論文 @ja
broader: Article
preferred label: مقال في دورية @ar
alternative label: журнальная публикация
alternative label: статьи в научных журналах
preferred label: article de revista @ca
narrower: статья о программном обеспечении
alternative label: 論文 @zh
alternative label: 期刊论文 @zh
broader: вклад в журнал
alternative label: 论文 @zh
alternative label: article de recherche @fr
related: JournalItem
broad match: Article
preferred label: članek v reviji @sl
preferred label: journal article @en
type: Concept
alternative label: article scientifique @fr
narrower: публикация данных
alternative label: журнальные статьи
preferred label: artículo @es
preferred label: articolo in rivista @it
alternative label: 記事 @ja
preferred label: článek v odborném časopisu @cs
alternative label: artículo revisado por pares @es
preferred label: Wissenschaftlicher Artikel @de
alternative label: articolo @it
narrower: обзорная статья
alternative label: 期刊論文 @zh
alternative label: artigo em revista @pt
related match: JournalItem
alternative label: 期刊文章 @zh
alternative label: article revisat per parells @ca
related match: SubmittedJournalArticle
preferred label: artigo @pt
alternative label: научная статья
related: SubmittedJournalArticle
alternative label: articulo cientifico @es
definition: An article on a particular topic and published in a journal issue. (adapted from fabio) [Source: http://dspacecris.eurocris.org/cris/classcerif/classcerif00423] @en
alternative label: journal articles @en
preferred label: 学术论文 @zh
modified: 2019-04-19T19:49:13+00:00
preferred label: dergi makalesi @tr
alternative label: paper @en
alternative label: журнальные публикации
alternative label: artigo científico @pt
alternative label: papier @fr
in scheme: Resource Types
narrower: опечатка
preferred label: wetenschappelijk artikel @nl
alternative label: статья
alternative label: artículo de revista @es
alternative label: научная работа
alternative label: статья в научном журнале
alternative label: 文章 @zh

техническая документация
alternative label: Technische Unterlagen @de
preferred label: teknik dokümantasyon @tr
preferred label: documentació tècnica @ca
type: Concept
preferred label: documentação técnica @pt
alternative label: manual @ca
alternative label: 技术文献 @zh
modified: 2018-09-10T18:43:17+00:00
broader: текстовый ресурс
alternative label: manual técnico @pt
alternative label: руководство
in scheme: Resource Types
definition: Technical documentation refers to any type of documentation that describes handling, functionality and architecture of a technical product or a product under development or use. [Source: https://en.wikipedia.org/wiki/Technical_documentation] @en
alternative label: documentacion tecnica @es
preferred label: وثائق تقنية @ar
preferred label: documentazione tecnica @it
broader: Document
broad match: Document
preferred label: technická dokumentace @cs
preferred label: 技術文書 @ja
preferred label: documentación técnica @es
preferred label: tehnična dokumentacija @sl
broader: Text
preferred label: manuel technique @fr
broad match: Text
alternative label: documentation technique @fr
alternative label: كتيب @ar
alternative label: manuale tecnico @it
preferred label: Technische Dokumentation @de
alternative label: 技術文獻 @zh
alternative label: 技術資料 @zh
alternative label: 技术文档 @zh
alternative label: 技術文檔 @zh
alternative label: технологические инструкции
preferred label: technische documentatie @nl
preferred label: technical documentation @en
preferred label: 技术资料 @zh
alternative label: пособие
alternative label: инструкция
alternative label: справочник

меморандум
alternative label: памятная записка
preferred label: memorando @pt
editorial note: Published
preferred label: memorandum @sl
alternative label: comunicat @ca
preferred label: Memorandum @de
alternative label: докладная записка
in scheme: Resource Types
broader: отчёт
alternative label: Denkschrift @de
alternative label: comunicado @es
preferred label: bilgi notu @tr
alternative label: 備忘錄 @zh
modified: 2018-09-10T18:43:29+00:00
alternative label: меморандумы
alternative label: comunicación @es
alternative label: circular @pt
preferred label: memoràndum @ca
definition: It is a note, document or other communication that helps the memory by recording events or observations on a topic. A memorandum can have only a certain number of formats; it may have a format specific to an office or institution. [Source: https://en.wikipedia.org/wiki/Memorandum] @en
type: Concept
alternative label: razprava @sl
preferred label: مذكرة @ar
created: 2015-07-17T14:34:15+00:00
alternative label: заметки
preferred label: memorándum @es
preferred label: mémo @fr
preferred label: メモランダム @ja
preferred label: 备忘录 @zh

рабочий документ
alternative label: discussion paper @en
preferred label: working paper @en
preferred label: 研究手稿 @zh
alternative label: ön makale @tr
alternative label: working or discussion paper @en
preferred label: ورقة عمل @ar
alternative label: 未發表論文 @zh
alternative label: documento di lavoro @it
alternative label: материалы для обсуждения
alternative label: рабочий отчёт
preferred label: pracovní dokument @cs
preferred label: delovna verzija članka @sl
alternative label: papier de travail @fr
alternative label: working papers @en
alternative label: documento de trabalho de investigação @pt
alternative label: 未发表论文 @zh
alternative label: préprint @fr
alternative label: дискуссионная статья
alternative label: werkdocument @nl
broader: Text
broad match: Text
preferred label: documento de trabajo @es
preferred label: ワーキングペーパー @ja
preferred label: Arbeitspapier @de
alternative label: çalışma belgesi @tr
preferred label: document de treball @ca
alternative label: ورقة مناقشة @ar
alternative label: pré-publication @fr
alternative label: document de travail @fr
alternative label: esborrany de treball @ca
broader: текстовый ресурс
preferred label: ön rapor @tr
alternative label: 工作底稿 @zh
alternative label: borrador de trabajo @es
alternative label: рабочий доклад
alternative label: проект документа
alternative label: documento de reflexão @pt
alternative label: memorando de investigação @pt
in scheme: Resource Types
alternative label: рабочие материалы
alternative label: промежуточная рабочая документация
definition: An unpublished paper, usually circulated privately among a small group of peers, to provide information or with a request for comments or editorial improvement. (source: fabio) @en
type: Concept
broader: Document
modified: 2019-04-19T18:21:39+00:00
alternative label: documento de trabalho @pt
broad match: Document

статья о программном обеспечении
in scheme: Resource Types
alternative label: статья о программировании и информационных технологиях
modified: 2018-09-10T18:43:51+00:00
preferred label: Softwareartikel @de
alternative label: article décrivant un logiciel @fr
editorial note: Published
alternative label: software tool article @en
type: Concept
alternative label: opis programske opreme @sl
definition: A software paper should include the rationale for the development of the tool and details of the code used for its construction. (Adapted from f1000) @en
preferred label: descripció de programari @ca
alternative label: article sobre programari @ca
broader: журнальная статья
preferred label: software artikel @nl
alternative label: руководство по программному обеспечению
preferred label: software paper @en
preferred label: ソフトウェア論文 @ja
preferred label: članek o programski opremi @sl
preferred label: artículo de software @es
created: 2018-05-06T17:13:53+00:00
alternative label: article sur un logiciel @fr

текстовый ресурс
narrower: рецензия
preferred label: テキスト @ja
narrower: научно-исследовательская работа
alternative label: текстовые ресурсы
narrower: рабочий документ
narrower: книга
alternative label: текстовый файл
preferred label: metin @tr
preferred label: Text @de
preferred label: texte @fr
narrower: блог
definition: A resource consisting primarily of words for reading. Examples include books, letters, dissertations, poems, newspapers, articles, archives of mailing lists. Note that facsimiles or images of texts are still of the genre Text. [Source: http://dublincore.org/documents/dcmi-terms/#dcmitype-Sound] @en
alternative label: текстовый материал
narrower: рукопись
narrower: примечание
preferred label: besedilo @sl
type: Concept
alternative label: 文檔 @zh
narrower: отчёт
preferred label: 文本 @zh
preferred label: text @en
narrower: библиография
preferred label: نص @ar
narrower: патент
narrower: препринт
narrower: предложение по исследованию
narrower: материалы конференции
alternative label: текст
preferred label: tekst @nl
alternative label: текстовые документы
alternative label: 文档 @zh
modified: 2019-04-19T20:09:35+00:00
alternative label: текстовый документ
preferred label: texto @pt
alternative label: текстовые материалы
preferred label: testo @it
editorial note: Published
narrower: материалы лекций
narrower: музыкальная нотация
narrower: техническая документация
narrower: письмо
narrower: периодическое издание
in scheme: Resource Types
alternative label: текстовые файлы
created: 2015-07-17T13:40:07+00:00
top concept of: Resource Types

диплом бакалавра
alternative label: monografia de fim de curso @pt
preferred label: lisans tezi @tr
broad match: Thesis
preferred label: treball de fi de grau @ca
alternative label: trabajo de fin de carrera @es
alternative label: tesis de bachiller @es
preferred label: bachelor thesis @en
alternative label: tesina @es
preferred label: proyecto fin de carrera @es
alternative label: диссертация бакалавра
alternative label: trabalho de fim de licenciatura @pt
preferred label: diplomsko delo @sl
preferred label: bachelorscriptie @nl
alternative label: monografia de licenciatura @pt
broader: научно-исследовательская работа
in scheme: Resource Types
alternative label: 本科毕业论文 @zh
broader: Thesis
preferred label: Abschlussarbeit (Bachelor) @de
alternative label: trabajo final de grado @es
preferred label: 学士学位论文 @zh
alternative label: 學士學位論文 @zh
alternative label: projecte final de carrera @ca
preferred label: 学士論文 @ja
modified: 2018-09-10T18:43:00+00:00
alternative label: bachelor dissertation @en
alternative label: rapport de stage @fr
alternative label: diplomska naloga @sl
preferred label: trabalho de fim de curso @pt
definition: A thesis reporting a research project undertaken as part of an undergraduate course of education leading to a bachelor's degree. (adapted from fabio) @en
preferred label: mémoire de stage @fr
alternative label: tesis de licenciatura @es
alternative label: 本科畢業論文 @zh
preferred label: رسالة بكالوريوس @ar
preferred label: tesi di laurea @it
preferred label: bakalářská práce @cs
type: Concept

блог
in scheme: Resource Types
alternative label: пост в блоге
broader: Blog
broad match: WebContent
alternative label: блог пост
preferred label: blog post @nl
alternative label: billet de blog @fr
alternative label: missatge de blog @ca
alternative label: notícia de blog @ca
definition: A piece of writing or other item of content published on a blog. (Adapted from oxforddictionaries) @en
broader: WebContent
type: Concept
broader: текстовый ресурс
preferred label: entrada de blog @ca
broad match: Blog
alternative label: post de blog @fr
preferred label: article de blog @fr
preferred label: Blogbeitrag @de
preferred label: Blog yazısı @tr
preferred label: prispevek na blogu @sl
preferred label: ブログ記事 @ja
created: 2018-05-06T16:36:18+00:00
editorial note: Published
preferred label: articolo di blog @it
alternative label: apunt de blog @ca
modified: 2019-04-19T19:30:11+00:00
alternative label: статья для блога

отчёт
alternative label: акт
alternative label: reporte @es
preferred label: rapporto @it
preferred label: rapport @nl
alternative label: 報告 @zh
narrower: научно-исследовательский отчёт
in scheme: Resource Types
narrower: финансовый отчёт
alternative label: доклад
alternative label: отчёты о НИР
alternative label: отчётный доклад
alternative label: 科研报告 @zh
narrower: общие положения
alternative label: рапорт
alternative label: memoria @es
narrower: результат проекта
alternative label: relacion @es
preferred label: informe @es
alternative label: 研究报告 @zh
alternative label: итоговый доклад
preferred label: Bericht @de
alternative label: отчёты о НИОКР
alternative label: estudi @ca
modified: 2019-04-19T20:02:54+00:00
alternative label: протокол
narrower: прочие отчёты
preferred label: relatório @pt
type: Concept
preferred label: تقرير @ar
preferred label: report @en
preferred label: rapor @tr
alternative label: estudio @es
preferred label: 报告 @zh
alternative label: обзорный доклад
alternative label: реферат
alternative label: научно-технический отчёт
broader: текстовый ресурс
alternative label: relación @es
alternative label: итоговый отчёт
alternative label: 调研报告 @zh
alternative label: reports @en
alternative label: итоговый документ
narrower: технический отчёт
preferred label: poročilo @sl
preferred label: zpráva @cs
narrower: часть доклада
broader: Document
broad match: Document
definition: A report is a separately published record of research findings, research still in progress, policy developments and events, or other technical findings, usually bearing a report number and sometimes a grant number assigned by the funding agency. Also, an official record of the activities of a committee or corporate entity, the proceedings of a government body, or an investigation by an agency, whether published or private, usually archived or submitted to a higher authority, voluntarily or under mandate. In a more general sense, any formal account of facts or information related to a specific event or phenomenon, sometimes given at regular intervals. [Source: http://lu.com/odlis/odlis_R.cfm#report ] @en
narrower: меморандум
broader: Text
broad match: Text
alternative label: paper @en
preferred label: 報告書 @ja
narrower: внутренний отчёт

диплом магистра
preferred label: رسالة ماجستير @ar
alternative label: tesi de mestratge @ca
alternative label: mémoire de maîtrise @fr
alternative label: rapport de master @fr
preferred label: 硕士学位论文 @zh
alternative label: tesina @es
preferred label: 修士論文 @ja
alternative label: 碩士研究生畢業論文 @zh
alternative label: диплом специалиста
preferred label: mémoire de master @fr
alternative label: tesis de maestria @es
preferred label: yüksek lisans tezi @tr
alternative label: rapport de maîtrise @fr
alternative label: 硕士研究生毕业论文 @zh
preferred label: masterscriptie @nl
alternative label: 碩士學位論文 @zh
alternative label: trabajo final de máster @es
alternative label: treball de fi de master @ca
alternative label: диссертация магистра
broader: Thesis
broad match: Thesis
alternative label: master dissertation @en
alternative label: trabajo final de maestría @es
preferred label: tesis de maestría @es
alternative label: tese de mestrado @pt
preferred label: master thesis @en
modified: 2018-09-10T18:43:00+00:00
preferred label: diplomová práce @cs
preferred label: treball de fi de postgrau @ca
broader: научно-исследовательская работа
preferred label: tesi di master @it
alternative label: trabajo final de posgrado @es
definition: A thesis reporting a research project undertaken as part of a graduate course of education leading to a master's degree. @en
in scheme: Resource Types
alternative label: trabajo final de master @es
preferred label: dissertação de mestrado @pt
preferred label: Abschlussarbeit (Master) @de
type: Concept
preferred label: magistrsko delo @sl
alternative label: magistrska naloga @sl

видео
modified: 2019-04-19T18:09:02+00:00
broad match: MovingImage
preferred label: video @sl
in scheme: Resource Types
broader: движущееся изображение
alternative label: видеофильм
alternative label: 動態影像 @zh
alternative label: видеозапись
preferred label: 録画資料 @ja
alternative label: видеоизображение
alternative label: 动态影像 @zh
preferred label: Video @de
alternative label: кинодокумент
preferred label: vidéo @fr
preferred label: فيد يو @ar
alternative label: кинофильм
broader: MovingImage
alternative label: кинематографический документ
alternative label: 視頻 @zh
created: 2015-07-17T13:44:31+00:00
preferred label: vídeo @pt
type: Concept
alternative label: видеодокумент
preferred label: 视频 @zh
alternative label: видеофонограмма
broader: Movie
broad match: Movie
definition: A recording of visual images, usually in motion and with sound accompaniment. [Source: http://www.ifla.org/files/assets/cataloguing/isbd/isbd-cons_20110321.pdf ] @en
editorial note: Published

журнал
alternative label: научный журнал
preferred label: odborné periodikum @cs
preferred label: wetenschappelijk tijdschrift @nl
alternative label: 學報 @zh
alternative label: продолжающееся издание
alternative label: periódico @pt
alternative label: pubblicazione periodica @it
alternative label: 科学期刊 @zh
preferred label: revista @es
alternative label: دورية علمية @ar
in scheme: Resource Types
narrow match: JournalArticle
alternative label: مجلة علمية @ar
alternative label: 科學期刊 @zh
alternative label: odborný časopis @cs
alternative label: научное издание
definition: A journal is a serial publication devoted to disseminating original research and current developments on a subject. (Adapted from ODLIS) [Source: http://dspacecris.eurocris.org/cris/classcerif/classcerif00422] @en
alternative label: периодическое журнальное издание
preferred label: rivista @it
narrower: JournalArticle
type: Concept
alternative label: revista académica @es
alternative label: revista científica @ca
preferred label: journal @en
modified: 2019-04-19T20:01:15+00:00
alternative label: revue scientifique @fr
preferred label: revue @fr
alternative label: 學術期刊 @zh
preferred label: Zeitschrift @de
broader: периодическое издание
preferred label: dergi @tr
alternative label: 学报 @zh
narrower: AcademicArticle
preferred label: 学術雑誌 @ja
preferred label: 学术期刊 @zh
narrower: вклад в журнал
alternative label: revista acadèmica @ca
preferred label: دورية @ar
alternative label: периодическое издание
preferred label: znanstvena revija @sl
alternative label: périodique @fr
broad match: Text
narrow match: AcademicArticle

материалы конференции
alternative label: اعمال المؤتمر @ar
alternative label: конференционные материалы
alternative label: prispevek na konferenci @sl
alternative label: presentacion a congreso @es
narrower: неопубликованный доклад конференции
alternative label: доклады конференции
preferred label: conferentiebijdrage @nl
preferred label: Konferenzveröffentlichung @de
alternative label: contribución a una conferencia @es
preferred label: predstavitev na konferenci @sl
preferred label: ادوات المؤتمر @ar
preferred label: contributo a congresso @it
type: Concept
preferred label: contribució a congrés @ca
preferred label: 会議発表資料 @ja
broader: текстовый ресурс
modified: 2019-04-11T22:41:01+00:00
alternative label: presentacion a una conferencia @es
alternative label: тезисы конференций
alternative label: contribuição em conferência @pt
alternative label: contribucion a una conferencia @es
definition: All kind of digital resources contributed to a conference, like conference presentation (slides), conference report, conference lecture, abstracts, demonstrations. For conference papers, posters or proceedings the specific concepts should be used.. @en
broader: Conference
alternative label: ponencia @es
broad match: Conference
alternative label: presentación a congreso @es
alternative label: реферат доклада
preferred label: konferenční dokument @cs
preferred label: contribución a congreso @es
preferred label: 会议文档 @zh
alternative label: аннотация
alternative label: contribució a un congrés @ca
in scheme: Resource Types
alternative label: труды конференции
alternative label: contribució a unes jornades @ca
preferred label: contribution à une conférence @fr
alternative label: 會議文檔 @zh
alternative label: опубликованные материалы конференций
preferred label: konferans nesnesi @tr
narrower: неопубликованный постер конференции
alternative label: contribucion a congreso @es
preferred label: conference object @en
alternative label: conferencia @es
preferred label: documento de conferência @pt
alternative label: presentación a una conferencia @es
broader: Event
broad match: Event
alternative label: contributo em conferência @pt
narrower: сборник материалов конференции

патент
in scheme: Resource Types
broader: Text
definition: A patent or patent application. @en
preferred label: Patent @de
preferred label: 特許 @ja
broad match: Text
preferred label: brevet @fr
preferred label: patent @tr
alternative label: 專利 @zh
alternative label: patents @en
preferred label: براءة الاختراع @ar
alternative label: patente de invención @es
alternative label: авторское свидетельство на изобретение
alternative label: patente de invencion @es
alternative label: патентная информация
alternative label: патент на промышленный образец
preferred label: 专利 @zh
definition: Патент или заявка на изобретение. Предоставление эксклюзивного права на эксплуатацию изобретения.
alternative label: диплом на открытие
type: Concept
alternative label: патент на изобретение
preferred label: patente @pt
broader: текстовый ресурс
preferred label: brevetto @it
alternative label: патент (свидетельство) на полезную модель
modified: 2019-04-19T20:00:18+00:00
alternative label: патентный документ
alternative label: патентное право

изображение
alternative label: изобразительный документ
alternative label: vizualna upodobitev @sl
alternative label: фотографическое изображение
preferred label: slika @sl
alternative label: оттиск
alternative label: 圖像 @zh
narrower: статическое изображение
top concept of: Resource Types
alternative label: beeldmateriaal @nl
alternative label: статическое изображение
narrower: StillImage
alternative label: figura @ca
alternative label: воспроизведение
preferred label: imatge @ca
alternative label: 圖片 @zh
preferred label: imagem @pt
alternative label: фотография
alternative label: копия
preferred label: image @fr
preferred label: afbeelding @nl
preferred label: Bild @de
preferred label: صورة @ar
preferred label: görüntü @tr
narrow match: StillImage
preferred label: imagen @es
definition: A visual representation other than text, including all types of moving image and still image. @en
type: Concept
alternative label: движущееся изображение
alternative label: 图片 @zh
preferred label: イメージ @ja
broad match: MediaObject
alternative label: динамическое изображение
alternative label: отображение
narrower: движущееся изображение
alternative label: 影像 @zh
alternative label: фотоснимок
broader: MediaObject
preferred label: immagine @it
modified: 2019-04-19T18:03:22+00:00
alternative label: imaj @tr
in scheme: Resource Types
preferred label: 图像 @zh
alternative label: неподвижное изображение
preferred label: obraz @cs
alternative label: образ
alternative label: иконографический документ

научно-исследовательская работа
alternative label: дипломная работа
alternative label: mémoire de thèse @fr
preferred label: thesis @en
alternative label: 毕业论文 @zh
preferred label: 学位论文 @zh
alternative label: tesina @ca
narrower: диссертация на соискание учёной степени
broad match: Text
preferred label: رسالة @ar
preferred label: tesi @it
in scheme: Resource Types
narrower: диплом бакалавра
preferred label: tez @tr
alternative label: научный труд
alternative label: тезис
narrower: диплом магистра
preferred label: tesis @es
broader: Text
preferred label: zaključno delo študija @sl
preferred label: 学位論文 @ja
alternative label: 學位論文 @zh
alternative label: диссертация
modified: 2019-04-19T20:12:33+00:00
definition: A thesis or dissertation is a document submitted in support of candidature for an academic degree or professional qualification presenting the author's research and findings. [Source: https://en.wikipedia.org/wiki/Thesis ] @en
preferred label: kvalifikační práce @cs
alternative label: 畢業論文 @zh
preferred label: scriptie @nl
preferred label: tese @pt
narrower: BachelorsThesis
alternative label: положение
alternative label: rapport de thèse @fr
alternative label: научная работа
type: Concept
preferred label: thèse @fr
broader: текстовый ресурс
narrow match: BachelorsThesis
alternative label: диплом
preferred label: schriftliche Abschlussarbeit @de

публикация данных
alternative label: artículo de datos científicos @es
preferred label: data paper @fr
preferred label: artigo de dados @pt
preferred label: Data Paper @de
alternative label: opis podatkovne zbirke @sl
preferred label: datadocumentatie @nl
alternative label: articulo de datos cientificos @es
type: Concept
definition: A data paper is a scholarly publication describing a particular dataset or group of dataset, published in the form of a peer-reviewed article in a scholarly journal. The main purpose of a data paper is to describe data, the circumstances of their collection, and information related to data features, access and potential reuse. Adapted from https://en.wikipedia.org/wiki/Data_paper and http://www.gbif.org/publishing-data/data-papers @en
preferred label: článek o datové sadě @cs
alternative label: Forschungsdatenartikel @de
alternative label: article sur les données @fr
alternative label: data descriptor @en
preferred label: データ論文 @ja
preferred label: artículo de datos @es
preferred label: ورقة بيانات @ar
alternative label: articulo de datos @es
preferred label: 数据文章 @zh
modified: 2018-09-10T18:43:43+00:00
preferred label: članek o podatkovni zbirki @sl
broader: журнальная статья
alternative label: 數據文章 @zh
in scheme: Resource Types
preferred label: article de dades @ca

предложение по исследованию
preferred label: اقتراح بحث @ar
in scheme: Resource Types
preferred label: proposta di progetto @it
preferred label: 研究計画書 @ja
alternative label: обоснование проблемы исследования
alternative label: 研究方案 @zh
alternative label: raziskovalna prijava @sl
alternative label: researchProposal @en
preferred label: Exposé @de
alternative label: propuesta de investigacion @es
preferred label: návrh výzkumného projektu @cs
preferred label: araştırma önerisi @tr
type: Concept
broader: текстовый ресурс
alternative label: propuesta de projecte @ca
alternative label: предложение по тематике исследования
alternative label: proposta di ricerca @it
alternative label: proposta de projeto @pt
alternative label: обоснование темы
preferred label: 研究计划 @zh
alternative label: propuesta de proyecto @es
preferred label: propuesta de recerca @ca
preferred label: proposta de investigação @pt
modified: 2019-04-19T18:29:01+00:00
preferred label: propuesta de investigación @es
alternative label: réponse à appel à projet @fr
preferred label: onderzoeksvoorstel @nl
alternative label: مقترح بحث @ar
alternative label: обоснование темы исследования
alternative label: propuesta d'investigació @ca
broader: Text
broad match: Text
alternative label: 研究計劃 @zh
alternative label: обоснование проекта
preferred label: research proposal @en
preferred label: projet de recherche @fr
preferred label: predlog raziskave @sl
definition: A research proposal is a document proposing a research project, generally in the sciences or academia, and generally constitutes a request for sponsorship of that research (https://en.wikipedia.org/wiki/Research_proposal) @en

фонодокумент
preferred label: suono @it
alternative label: 聲音 @zh
editorial note: Published
preferred label: som @pt
modified: 2019-04-19T18:05:38+00:00
preferred label: 音声・音楽 @ja
alternative label: geluid @nl
broad match: MediaObject
alternative label: تسجيل صوتي @ar
in scheme: Resource Types
alternative label: zvok @sl
alternative label: звук
narrower: музыкальная композиция
preferred label: sonido @es
top concept of: Resource Types
preferred label: sound @en
preferred label: son @fr
preferred label: صوت @ar
alternative label: фонозапись
alternative label: аудиальный документ
alternative label: enregistrement sonore @fr
preferred label: so @ca
preferred label: Ton @de
preferred label: zvočni zapis @sl
alternative label: document sonore @fr
preferred label: 声音 @zh
type: Concept
alternative label: звукозапись
preferred label: zvuk @cs
created: 2015-07-17T13:41:50+00:00
preferred label: ses @tr
broader: MediaObject
definition: A resource primarily intended to be heard. Examples include a music playback file format, an audio compact disc, and recorded speech or sounds. [Source: http://dublincore.org/documents/dcmi-terms/#dcmitype-Sound] @en

прочие отчёты
broader: отчёт
preferred label: rapport overig @nl
preferred label: 其他报告 @zh
preferred label: altre tipus d'informe @ca
alternative label: прочие докумены и отчёты
alternative label: laboratory material @en
alternative label: 其它報告 @zh
in scheme: Resource Types
alternative label: otro tipo de reporte @es
preferred label: otro tipo de informe @es
preferred label: نوع آخر من التقرير @ar
preferred label: jiná zpráva @cs
preferred label: altro tipo di rapporto @it
preferred label: other type of report @en
created: 2015-07-17T14:34:34+00:00
type: Concept
alternative label: outro tipo de relatório @pt
preferred label: diğer rapor türü @tr
preferred label: outro relatório @pt
preferred label: その他の報告書 @ja
alternative label: прочие доклады
preferred label: autre type de rapport @fr
alternative label: guideline @en
modified: 2019-04-17T21:31:15+00:00
preferred label: sonstiger Report @de
alternative label: ander type rapport @nl
preferred label: ostale vrste poročil @sl
definition: Other types of report may include Business Plans Technical Specifications, data management plans, recommendation reports, white papers, annual reports, auditor's reports, workplace reports, census reports, trip reports, progress reports, investigative reports, budget reports, policy reports, demographic reports, credit reports, appraisal reports, inspection reports, military reports, bound reports, etc. [Source: https://en.wikipedia.org/wiki/Report] @en
editorial note: Deprecated

внутренний отчёт
preferred label: internal report @en
preferred label: تقرير داخلي @ar
editorial note: Deprecated
alternative label: служебный отчёт
broader: отчёт
preferred label: informe intern @ca
preferred label: rapport interne @fr
preferred label: 内部报告 @zh
in scheme: Resource Types
preferred label: interno poročilo @sl
preferred label: rapporto interno @it
definition: An internal report is a record of findings collected for internal use. It is not designed to be made public and may include confidential or proprietary information. @en
preferred label: interner Bericht @de
created: 2015-07-17T14:33:39+00:00
alternative label: 內部報告 @zh
alternative label: reporte de uso interno @es
preferred label: interní zpráva @cs
preferred label: dahili rapor @tr
preferred label: 内部報告書 @ja
preferred label: informe interno @es
alternative label: notranje poročilo @sl
preferred label: intern rapport @nl
type: Concept
alternative label: отчёт для внутренней рассылки
preferred label: relatório interno @pt
modified: 2019-04-17T21:31:17+00:00

статья для конференции
alternative label: presentacion de congreso @es
alternative label: 會議文章 @zh
preferred label: conference paper @en
alternative label: artigo de congresso @pt
alternative label: prispevek na konferenci @sl
alternative label: 會議論文 @zh
alternative label: тезисы конференции
alternative label: статья для научной конференции
alternative label: comunicação em congresso @pt
alternative label: trabajo presentado en una conferencia @es
alternative label: статьи конференции
broader: сборник материалов конференции
preferred label: članek na konfrenci @sl
alternative label: comunicacion de conferencia @es
alternative label: presentació de congrés @ca
alternative label: conferencePaper @en
definition: A conference paper that is submitted to a conference and presented to the audience. The conference paper is published in proceedings. @en
alternative label: comunicação @pt
alternative label: 会议文章 @zh
alternative label: article de congrès @fr
alternative label: článek ve sborníku konference @cs
preferred label: article dans une conférence @fr
alternative label: documento presentado en una conferencia @es
preferred label: comunicação em conferência @pt
preferred label: comunicación de congreso @es
preferred label: příspěvek na konferenci @cs
preferred label: Konferenzbeitrag @de
preferred label: konferans belgesi @tr
preferred label: 会議発表論文 @ja
broad match: Event
alternative label: comunicación de conferencia @es
alternative label: اوراق المؤتمر @ar
alternative label: article de conférence @fr
modified: 2019-04-19T19:39:30+00:00
preferred label: comunicazione a congresso @it
preferred label: 会议论文 @zh
in scheme: Resource Types
alternative label: documento presentado en un congreso @es
alternative label: доклад для конференции
type: Concept
alternative label: presentación de congreso @es
preferred label: comunicació de congrés @ca
preferred label: ورقة مؤتمر @ar
alternative label: conference papers @en
preferred label: conferentie bijdrage @nl
alternative label: доклад конференции
alternative label: artigo de conferência @pt
alternative label: trabajo presentado en un congreso @es
alternative label: apresentação em conferência @pt
alternative label: comunicacion de congreso @es
alternative label: тезисы докладов
alternative label: apresentação em congresso @pt
broad match: Conference
alternative label: članek na konferenci @sl

картографические ресурсы
alternative label: картматериал
preferred label: kartografik malzeme @tr
preferred label: cartografisch materiaal @nl
preferred label: 地図資料 @ja
alternative label: kartografski material @sl
preferred label: material cartográfico @es
alternative label: materiale cartografico @it
editorial note: Published
alternative label: картографические материалы
alternative label: картографический материал
preferred label: kartographisches Material @de
alternative label: material cartografico @es
top concept of: Resource Types
in scheme: Resource Types
preferred label: kartografsko gradivo @sl
created: 2015-07-17T13:37:43+00:00
preferred label: مادة خرائطية @ar
preferred label: cartografia @it
narrower: карта
alternative label: картографическое произведение
modified: 2018-09-03T14:37:24+00:00
preferred label: matériel cartographique @fr
alternative label: 地圖類資料 @zh
definition: Any material representing the whole or part of the earth or any celestial body at any scale. Cartographic materials include two- and three-dimensional maps and plans (including maps of imaginary places); aeronautical, navigational, and celestial charts; atlases; globes; block diagrams; sections; aerial photographs with a cartographic purpose; bird's-eye views (map views), etc. [Source: http://www.loc.gov/marc/cfmap.html] @en
preferred label: 地图类资料 @zh
type: Concept
preferred label: kartografický dokument @cs
preferred label: cartographic material @en
preferred label: material cartogràfic @ca

музыкальная нотация
modified: 2018-09-03T14:38:37+00:00
alternative label: partition de musique @fr
preferred label: Musiknotation @de
definition: Musical notation is any system used to visually represent aurally perceived music through the use of written symbols, including ancient or modern musical symbols. [Source: https://en.wikipedia.org/wiki/Musical_notation] @en
preferred label: 楽譜 @ja
alternative label: noty @cs
preferred label: تدوينة موسيقية @ar
preferred label: notação musical @pt
alternative label: partitura @pt
preferred label: notación musical @es
type: Concept
broader: текстовый ресурс
preferred label: nota @tr
preferred label: notació musical @ca
alternative label: нотная запись
preferred label: partition @fr
preferred label: hudební zápis @cs
editorial note: Published
preferred label: notazione musicale @it
preferred label: 乐谱 @zh
alternative label: notenschrift @nl
alternative label: 樂譜 @zh
created: 2015-07-17T13:40:27+00:00
preferred label: musical notation @en
alternative label: notacion musical @es
alternative label: partition musicale @fr
alternative label: music notation @en
in scheme: Resource Types
preferred label: muzieknotatie @nl
alternative label: ноты
alternative label: Notenschrift @de
alternative label: مدونة موسيقية @ar
preferred label: note @sl

карта
alternative label: планово-картографический материал
preferred label: zemljevid @sl
preferred label: mapa @pt
alternative label: carte @fr
preferred label: harita @tr
broader: картографические ресурсы
definition: Defined as a representation normally to scale and on a flat medium, of a selection of material or abstract features on, or in relation to, the surface of the earth or of another celestial body. [Source: https://www.loc.gov/marc/bibliographic/bd007a.html] @en
alternative label: 地圖 @zh
preferred label: 地图 @zh
preferred label: carte géographique @fr
alternative label: plan @fr
preferred label: 地図 @ja
preferred label: خارطة @ar
modified: 2018-09-03T14:37:23+00:00
type: Concept
alternative label: чертёж
preferred label: kaart @nl
alternative label: план
alternative label: отображение
preferred label: map @en
preferred label: mappa @it
editorial note: Published
definition: harita @tr
preferred label: Karte @de
alternative label: схема
alternative label: geografska karta @sl
in scheme: Resource Types
created: 2015-07-17T13:38:13+00:00

раздел книги
alternative label: capitulo de libro @es
preferred label: poglavje v knjigi @sl
alternative label: 章節 @zh
type: Concept
alternative label: глава книги
preferred label: capítol de llibre @ca
alternative label: sestavek v knjigi @sl
alternative label: partie d'ouvrage @fr
alternative label: chapter in book @en
preferred label: 図書（部分） @ja
definition: A defined chapter or section of a book, usually with a separate title or number. @en
alternative label: chapitre de livre @fr
preferred label: capítulo de livro @pt
preferred label: capitolo di libro @it
broader: книга
alternative label: parte de libro @es
broader: Book
preferred label: boekdeel @nl
alternative label: parte de um livro @pt
alternative label: capítulo @pt
alternative label: paragrafo @it
alternative label: книжная глава
preferred label: capítulo de libro @es
preferred label: Teil oder Kapitel eines Buches @de
alternative label: chapter @en
broad match: Book
in scheme: Resource Types
narrower: Article
alternative label: فصل من كتاب @ar
alternative label: часть книги
preferred label: 章节 @zh
preferred label: book part @en
preferred label: část knihy @cs
preferred label: kitap bölümü @tr
alternative label: kapitola v knize @cs
narrow match: Article
preferred label: chapitre d'ouvrage @fr
alternative label: book chapters @en
modified: 2019-04-19T19:32:29+00:00
preferred label: جزء من كتاب @ar
alternative label: part de llibre @ca
alternative label: book chapter @en

сборник материалов конференции
alternative label: тезисы и статьи конференции
alternative label: 会刊 @zh
alternative label: libro de ponencias @es
type: Concept
narrower: статья для конференции
preferred label: konferans bildirileri @tr
alternative label: сборник конференции
preferred label: actes de conférence @fr
preferred label: وقائع المؤتمر @ar
modified: 2019-04-11T22:41:01+00:00
alternative label: сборник статей
alternative label: atas de congresso @pt
preferred label: atti di congresso @it
preferred label: zbornik prispevkov na konferenci @sl
preferred label: Tagungsband @de
preferred label: actas de congreso @es
in scheme: Resource Types
alternative label: труды конференции
preferred label: conference proceedings @en
definition: Conference proceedings is the official record of a conference meeting. It is a collection of documents which corresponds to the presentations given at the conference. It may include additional content. [Source: http://www.ieee.org/documents/confprocdefined.pdf ] @en
alternative label: اوراق المؤتمر @ar
narrower: постер конференции
preferred label: actes de congrés @ca
alternative label: сборники докладов конференции
alternative label: доклад на конференцию
preferred label: atas de conferência @pt
alternative label: llibre de ponències @ca
alternative label: actes de congrès @fr
alternative label: اعمال المؤتمر @ar
alternative label: actas de conferência @pt
alternative label: 會刊 @zh
preferred label: 会议论文集 @zh
alternative label: сборник докладов
preferred label: sborník konference @cs
alternative label: 會議論文集 @zh
alternative label: actas de congresso @pt
preferred label: 会議録 @ja
broader: материалы конференции
alternative label: actas de conferencia @es

веб-сайт
preferred label: website @en
alternative label: конференция
type: Concept
alternative label: конгресс
alternative label: pàgina web @ca
alternative label: sítio na internet @pt
preferred label: sítio web @pt
alternative label: интернет-сайт
alternative label: съезд
alternative label: portal web @es
preferred label: ウェブサイト @ja
alternative label: 讨论会 @zh
preferred label: موقع الكتروني @ar
preferred label: webové sídlo @cs
alternative label: pagine web @it
alternative label: portal @es
alternative label: научная конференция
alternative label: практикум
broader: интерактивный ресурс
alternative label: sitios web @es
alternative label: página web @pt
alternative label: 網站 @zh
alternative label: صفحة الويب @ar
preferred label: spletna stran @sl
alternative label: páginas web @es
alternative label: pagina web @es
preferred label: 网站 @zh
modified: 2019-04-19T18:13:27+00:00
alternative label: портал
definition: A website, also written as web site or simply site, is a set of related web pages typically served from a single web domain. A website is hosted on at least one web server, accessible via a network such as the Internet or a private local area network through an Internet address known as a uniform resource locator (URL). All publicly accessible websites collectively constitute the World Wide Web. [Source: https://en.wikipedia.org/wiki/Website ] @en
alternative label: webpage @en
alternative label: вебсайт
alternative label: совещание
preferred label: web sitesi @tr
alternative label: paginas web @es
in scheme: Resource Types
preferred label: sito web @it
alternative label: servidor web @es
alternative label: семинар
preferred label: Webseite @de
alternative label: веб-ресурс
alternative label: webové stránky @cs
alternative label: web-сайт
alternative label: симпозиум
alternative label: веб-сервис
alternative label: веб-страница
preferred label: lloc web @ca
alternative label: portail web @fr
preferred label: sitio web @es
editorial note: Published
preferred label: site web @fr
alternative label: сайт

неопубликованный постер конференции
alternative label: неопубликованные плакаты конференции
preferred label: 未发表在会议论文集中的海报 @zh
alternative label: póster não publicado nas atas do congresso @pt
preferred label: poster @sl
preferred label: poster non pubblicato in atti di congresso @it
in scheme: Resource Types
preferred label: yayınlanmamış konferans posteri @tr
preferred label: póster não publicado nas atas da conferência @pt
definition: A display poster, typically containing text with illustrative figures and/or tables, usually reporting research results or proposing hypotheses, submitted for acceptance to and/or presented at a conference, seminar, symposium, workshop or similar event. (Adapted from fabio) @en
modified: 2018-09-10T18:43:29+00:00
alternative label: неопубликованные постеры конференции
editorial note: Proposed deprecated
preferred label: conferentie poster niet in proceedings @nl
preferred label: 会議発表ポスター（会議録未掲載） @ja
broader: материалы конференции
preferred label: Konferenzposter nicht im Tagungsband @de
alternative label: plakat @sl
type: Concept
preferred label: poster dans une conférence non publié dans les actes @fr
alternative label: poster de conférence non publié dans les actes @fr
preferred label: poster no publicat en actes de congrés @ca
alternative label: 未發表在會議論文集中的海報 @zh
preferred label: póster no publicado en actas de congreso @es
alternative label: неопубликованный плакат конференции
created: 2015-07-17T14:28:30+00:00
preferred label: konferenční poster nezahrnutý ve sborníku @cs
alternative label: неопубликованные плакаты конференций
preferred label: conference poster not in proceedings @en

интерактивный ресурс
alternative label: interaktivni vir @sl
preferred label: recurso interactivo @es
alternative label: 互動資源 @zh
modified: 2018-09-10T18:42:42+00:00
alternative label: материалы конференций (неопубликованные)
preferred label: recurs interactiu @ca
definition: A resource requiring interaction from the user to be understood, executed, or experienced. Examples include forms on Web pages, applets, multimedia learning objects, chat services, or virtual reality environments. [Source: http://dublincore.org/documents/2010/10/11/dcmi-type-vocabulary/ ] @en
preferred label: インタラクティブリソース @ja
preferred label: 互动资源 @zh
in scheme: Resource Types
alternative label: сборник статей
narrower: веб-сайт
preferred label: interactive resource @en
top concept of: Resource Types
preferred label: risorsa interattiva @it
alternative label: интерактивный электронный документ
alternative label: contributo a convegno @it
alternative label: интерактивный документ
preferred label: interactieve bron @nl
alternative label: 交互式資源 @zh
preferred label: مورد تفاعلي @ar
alternative label: неопубликованные документы
alternative label: 交互式资源 @zh
preferred label: recurso interativo @pt
preferred label: etkileşimli kaynak @tr
preferred label: interaktive Ressource @de
type: Concept
preferred label: ressource interactive @fr
preferred label: interaktivní zdroj @cs

научно-исследовательский отчёт
alternative label: informe cientifico @es
alternative label: научный отчёт
alternative label: 研究報告 @zh
alternative label: rapport scientifique @fr
preferred label: 研究报告 @zh
definition: Research Reports are reports that typically provide an in-depth study of a particular topic or describe the results of a research project. [Source: http://www.buildingscience.com/doctypes/reports] @en
preferred label: research report @en
created: 2015-07-17T14:30:34+00:00
preferred label: araştırma raporu @tr
preferred label: poročilo o rezultatih raziskav @sl
in scheme: Resource Types
broader: отчёт
alternative label: memòria científica @ca
preferred label: rapporto di ricerca @it
preferred label: výzkumná zpráva @cs
alternative label: отчёты о НИР
alternative label: отчёт о НИР
alternative label: تقرير بحث @ar
preferred label: Forschungsbericht @de
preferred label: informe de recerca @ca
alternative label: 調研報告 @zh
alternative label: 科研报告 @zh
preferred label: rapport de recherche @fr
alternative label: отчёт о научном исследовании
alternative label: отчёты о НИОКР
alternative label: отчёт по научно-исследовательской работе
alternative label: отчёт о научно-исследовательской работе
alternative label: отчёт о научных исследованиях
type: Concept
alternative label: memoria científica @es
alternative label: научно-технический отчёт
modified: 2018-09-10T18:43:28+00:00
alternative label: informe del resultado de una investigación @es
alternative label: отчёт о НИОКР
preferred label: informe científico @es
alternative label: informe de investigacion @es
alternative label: تقرير علمي @ar
alternative label: 调研报告 @zh
editorial note: Published
preferred label: onderzoeksrapport @nl
preferred label: relatório de investigação @pt
alternative label: reporte cientifico @es
alternative label: informe de investigación @es
alternative label: отчёт о научно-исследовательской деятельности
alternative label: informe científic @ca
alternative label: reporte de investigación @es
preferred label: 研究報告書 @ja
alternative label: reporte científico @es
alternative label: 科研報告 @zh

письмо
preferred label: letter @en
alternative label: missiva @pt
preferred label: carta @ca
type: Concept
broader: Document
preferred label: lettre @fr
broad match: Document
definition: Бумага с написанным на ней от руки или напечатанным текстом, служащая средством общения между физическими лицами и/или представителями юридических лиц. Как правило, письмо доставляется почтовой службой или публикуется в периодическом издании. В последнем случае, письмо адресовывается редактору/редакции, и комментирует или обсуждает статью, опубликованную ранее в этом периодическом издании, или представляет интерес для конкретной читательской аудитории.
alternative label: polemika @sl
alternative label: Korrespondenz @de
preferred label: 信 @zh
preferred label: pismo @sl
alternative label: сопроводительное письмо
preferred label: brief @nl
definition: A brief description of important new research, also known as “communication”. (adapted from EuroCRIS) @en
preferred label: رسالة @ar
in scheme: Resource Types
alternative label: 讀者來信 @zh
preferred label: Brief @de
alternative label: dikusijski prispevek @sl
preferred label: dopis @cs
alternative label: 读者来信 @zh
preferred label: 短報 @ja
broader: Text
broad match: Text
alternative label: Leserbrief @de
modified: 2019-04-19T19:50:40+00:00
alternative label: письмо редактору
preferred label: mektup @tr
alternative label: lettera @it
preferred label: comunicazione @it
broader: текстовый ресурс

программное обеспечение
preferred label: software @en
related: Computer code
alternative label: programa informático @es
alternative label: programme informatique @fr
preferred label: 软件 @zh
preferred label: برنامج حاسوب @ar
broader: SoftwareApplication
top concept of: Resource Types
alternative label: документация программного продукта
preferred label: logiciel @fr
hidden label: programas informaticos @es
preferred label: programari @ca
alternative label: 软体 @zh
alternative label: programa informatico @es
alternative label: programa informàtic @ca
preferred label: ソフトウェア @ja
narrower: научное программное обеспечение
type: Concept
alternative label: développement informatique @fr
preferred label: programska oprema @sl
alternative label: programa de computador @pt
alternative label: برنامج كمبيوتر @ar
alternative label: programma informatico @it
alternative label: программные продукты
alternative label: 軟件 @zh
related match: Computer code
alternative label: программная документация
broader: cop
in scheme: Resource Types
modified: 2019-04-19T20:08:06+00:00
broad match: SoftwareApplication
preferred label: Software @de
broad match: cop
alternative label: 軟體 @zh
alternative label: программа
preferred label: yazılım @tr
definition: A computer program in source code (text) or compiled form. @en
alternative label: počítačový program @cs
alternative label: программные средства

редакционная статья
preferred label: editorial @pt
alternative label: 社評 @zh
alternative label: передовая статья
preferred label: éditorial @fr
definition: A brief essay expressing the opinion or position of the chief editor(s) of a (academic) journal with respect to a current political, social, cultural, or professional issue. Adapted from ODLIS [Source: http://www.abc-clio.com/ODLIS/odlis_e.aspx ] @en
alternative label: Leitartikel @de
preferred label: Vorwort @de
modified: 2019-04-19T19:46:01+00:00
alternative label: 社评 @zh
alternative label: édito @fr
alternative label: tribuna de opinión @es
preferred label: editoriale @it
preferred label: Editoryal @tr
preferred label: editorial de revista @ca
in scheme: Resource Types
preferred label: úvodník @cs
preferred label: エディトリアル @ja
preferred label: uvodnik @sl
alternative label: аудиовизуальные материалы
alternative label: аудиовизуальные пособия
alternative label: 社論 @zh
broader: вклад в журнал
preferred label: افتتاحية @ar
type: Concept
alternative label: artículo de fondo @es
alternative label: аудиовизуальные средства обучения
preferred label: 社论 @zh
preferred label: voorwoord @nl

движущееся изображение
narrower: видео
preferred label: gibljiva slika @sl
alternative label: سمعي بصري @ar
alternative label: аудиовизуальный ресурс
alternative label: 动画 @zh
preferred label: Bewegte Bilder @de
preferred label: pohyblivý obraz @cs
alternative label: аудиовизуальные материалы
preferred label: 動画 @ja
alternative label: аудиовизуальный документ
preferred label: moving image @en
in scheme: Resource Types
preferred label: immagine dinamica @it
preferred label: 运动图像 @zh
preferred label: imagem animada @pt
alternative label: 運動圖像 @zh
alternative label: imagem em movimento @pt
preferred label: hareketli görüntü @tr
preferred label: imatge en moviment @ca
type: Concept
alternative label: audiovisual @en
broader: изображение
preferred label: image animée @fr
alternative label: динамичное изображение
alternative label: динамическое изображение
alternative label: imagen en movimiento @es
alternative label: аудиовизуальные ресурсы
preferred label: filmmateriaal @nl
modified: 2019-04-11T23:34:24+00:00
preferred label: صورة متحركة @ar
preferred label: imagen dinámica @es
alternative label: imagen dinamica @es
alternative label: 動畫 @zh
definition: A moving display, either generated dynamically by a computer program or formed from a series of pre-recorded still images imparting an impression of motion when shown in succession. (adapted from fabio) @en
alternative label: динамические изображения

музыкальная композиция
alternative label: obra de música @es
in scheme: Resource Types
alternative label: قطعة موسيقية @ar
modified: 2019-04-19T18:09:50+00:00
alternative label: pieza de música @es
preferred label: composición musical @es
alternative label: composicion musical @es
preferred label: composição musical @pt
alternative label: glasbeno delo @sl
alternative label: 音乐作品 @zh
alternative label: partitura @ca
created: 2015-07-17T13:42:30+00:00
preferred label: composizione musicale @it
editorial note: Published
preferred label: 音乐 @zh
type: Concept
alternative label: музыкальное произведение
broader: фонодокумент
preferred label: musical composition @en
alternative label: hudební kompozice @cs
preferred label: muzikale compositie @nl
alternative label: Tonsatz @de
preferred label: تأليف موسيقي @ar
definition: Musical composition can refer to an original piece of music, the structure of a musical piece, or the process of creating a new piece of music. [Source: https://en.wikipedia.org/wiki/Musical_composition ] @en
alternative label: 音樂 @zh
alternative label: obra de musica @es
preferred label: hudební skladba @cs
alternative label: pieza de musica @es
preferred label: musikalische Komposition @de
preferred label: müzikal kompozisyon @tr
preferred label: composition musicale @fr
alternative label: pieza musical @es
preferred label: composició musical @ca
alternative label: 音樂作品 @zh
alternative label: obra musical @es
preferred label: 音楽 @ja
preferred label: skladba @sl

примечание
preferred label: açıklama @tr
preferred label: annotation @en
related match: LegalOpinion
alternative label: comentario @es
preferred label: nota de jurisprudencia @es
broad match: Text
modified: 2019-04-19T19:55:57+00:00
alternative label: glosa @pt
alternative label: 诠释 @zh
alternative label: комментарий
preferred label: شرح @ar
in scheme: Resource Types
alternative label: 詮釋 @zh
broader: Text
alternative label: apontamento @pt
alternative label: 注释 @zh
alternative label: pravno mnenje @sl
alternative label: nota @es
preferred label: zaznamek @sl
type: Concept
preferred label: Entscheidungs- oder Urteilsanmerkung @de
preferred label: 标注 @zh
alternative label: nota a un texto de jurisprudencia @es
alternative label: opomba @sl
alternative label: dipnot @tr
alternative label: anotación @es
alternative label: glossa @it
alternative label: comentário @pt
alternative label: 註釋 @zh
preferred label: commento @it
preferred label: annotatie @nl
related: LegalOpinion
preferred label: anotação @pt
alternative label: annotazione @it
alternative label: Kommentierung @de
preferred label: 注釈 @ja
definition: An annotation in the sense of a legal note is a legally explanatory comment on a decision handed down by a court or arbitral tribunal. @en
broader: Document
alternative label: zaznamba @sl
alternative label: аннотация
preferred label: právní komentář rozsudku nebo rozhodnutí @cs
broader: текстовый ресурс
alternative label: 標注 @zh
broad match: Document
preferred label: anotació @ca

план управления данными
alternative label: план осуществления управления данными
preferred label: plan de gestión de datos @es
preferred label: pla de gestió de dades @ca
preferred label: Datenmanagementplan @de
preferred label: načrt ravnanja s podatki @sl
alternative label: план регулирования информацией и данными
preferred label: plan de gestion de données @fr
preferred label: データ管理計画 @ja
editorial note: Published
type: Concept
preferred label: piano di gestione dei dati @it
in scheme: Resource Types
modified: 2019-04-19T19:41:33+00:00
alternative label: pla d’administració de dades @ca
broader: результат проекта
alternative label: načrt upravljanja s podatki @sl
created: 2018-05-06T16:40:25+00:00
preferred label: data management plan @en
definition: A formal document that outlines how and where data will be collected and managed, both during and after a research project (Adapted from Wikipedia) [Source: https://en.wikipedia.org/wiki/Data_management_plan] @en

рецензия
alternative label: recension @fr
alternative label: critica @es
preferred label: recensão @pt
in scheme: Resource Types
definition: A review of others' published work. @en
modified: 2018-09-10T18:43:43+00:00
broader: Text
alternative label: 評論 @zh
alternative label: 評審 @zh
preferred label: recensione @it
preferred label: recenze @cs
preferred label: review @en
alternative label: обзор
preferred label: recenzija @sl
preferred label: synthèse @fr
preferred label: eleştiri @tr
alternative label: derleme @tr
alternative label: обозрение
alternative label: rassegna @it
narrower: рецензия на книгу
preferred label: レビュー @ja
alternative label: comentari @ca
alternative label: article de synthèse @fr
alternative label: recensió @ca
broad match: Document
alternative label: recensão crítica @pt
alternative label: 綜述 @zh
preferred label: 评论 @zh
preferred label: reseña @es
preferred label: مراجعة @ar
alternative label: критическая статья
broad match: Text
type: Concept
broader: Document
broader: текстовый ресурс
alternative label: 综述 @zh
preferred label: ressenya @ca
alternative label: resenha @pt
alternative label: comentario @es
alternative label: نقد @ar
alternative label: recensión @es
alternative label: revisão @pt
alternative label: revisió @ca
preferred label: Rezension @de
alternative label: 评审 @zh
alternative label: crítica @es
alternative label: отзыв
alternative label: bespreking @nl

книга
modified: 2019-04-19T19:31:17+00:00
alternative label: рукопись
narrow match: BookReview
alternative label: собрание сочинений
narrower: BookSection
alternative label: livre @fr
definition: A non-serial publication that is complete in one volume or a designated finite number of volumes. (adapted from CiTO; EPrint Type vocabulary) @en
alternative label: 图书 @zh
alternative label: учебное издание
broader: Document
alternative label: сборник
broad match: Document
preferred label: 図書 @ja
alternative label: افرودة @ar
preferred label: kniha @cs
alternative label: monografia @es
alternative label: audiobook @en
broader: Text
broad match: Text
narrower: раздел книги
alternative label: monograph @en
alternative label: obra monografica @es
alternative label: monographie @fr
alternative label: 書 @zh
alternative label: 专著 @zh
preferred label: monografija @sl
alternative label: 圖書 @zh
preferred label: كتاب @ar
alternative label: obra monográfica @es
alternative label: справочник
alternative label: сборник трудов
preferred label: libro @es
alternative label: monografie @cs
alternative label: e-book @en
related: Book
alternative label: monografía @es
related match: Book
in scheme: Resource Types
preferred label: book @en
preferred label: ouvrage @fr
alternative label: брошюра
alternative label: учебное пособие
narrower: Chapter
type: Concept
alternative label: Monographie @de
narrower: BookReview
alternative label: сборник научных трудов
preferred label: kitap @tr
preferred label: Buch @de
preferred label: livro @pt
preferred label: 书 @zh
broader: текстовый ресурс
alternative label: books @en
narrow match: BookSection
alternative label: учебник
preferred label: llibre @ca
preferred label: boek @nl
alternative label: knjiga @sl
alternative label: монография
alternative label: 專著 @zh
narrow match: Chapter

набор данных
alternative label: картматериал
alternative label: наборы данных
broad match: Data publication
preferred label: conjunto de dados @pt
broader: Research data
preferred label: jeu de données @fr
alternative label: 资料组 @zh
preferred label: مجموعة بيانات @ar
alternative label: grupo de datos @es
preferred label: podatkovna zbirka @sl
alternative label: سلسلة بيانات @ar
alternative label: data sets @en
alternative label: base de datos @es
alternative label: dades de recerca @ca
related: cod
broader: Data publication
preferred label: データセット @ja
preferred label: dataset @nl
in scheme: Resource Types
modified: 2019-04-19T19:44:43+00:00
top concept of: Resource Types
preferred label: Datensatz @de
related match: cod
narrower: интервью
preferred label: 数据集 @zh
alternative label: массив данных
preferred label: datová sada @cs
alternative label: 數據集 @zh
alternative label: base de dados @pt
alternative label: база данных
alternative label: série de données @fr
alternative label: 資料組 @zh
alternative label: grup de dades @ca
definition: A collection of related facts and data encoded in a defined structure. (adapted from fabio; DataCite) @en
preferred label: conjunt de dades @ca
preferred label: veri seti @tr
alternative label: zbirka podatkov @sl
broad match: Research data
type: Concept
preferred label: conjunto de datos @es

учебный объект
alternative label: учебные блоки
editorial note: Published
preferred label: objeto de aprendizaje @es
alternative label: Kursmaterial @de
preferred label: materiale didattico @it
preferred label: objecte d’aprenentatge @ca
alternative label: обучающие блоки
preferred label: učno gradivo @sl
alternative label: odprti učni vir @sl
in scheme: Resource Types
modified: 2019-04-17T21:31:29+00:00
preferred label: 教材 @ja
preferred label: object d'apprentissage @fr
preferred label: Lernobjekt @de
preferred label: learning object @en
top concept of: Resource Types
preferred label: Öğrenim nesnesi @tr
alternative label: Lernunterlagen @de
type: Concept
alternative label: open education resource @en
alternative label: coursepack @en
created: 2018-05-06T16:52:15+00:00
preferred label: leerobject @nl

материалы лекций
preferred label: predavanje @sl
preferred label: lecture @nl
preferred label: ponencia @es
preferred label: Vorlesung @de
preferred label: conferència acadèmica @ca
alternative label: charla magistral @es
alternative label: conferência @pt
alternative label: 講座 @zh
preferred label: 講演 @ja
type: Concept
alternative label: محاضرات @ar
alternative label: enseignement magistral @fr
alternative label: 讲课 @zh
broader: текстовый ресурс
alternative label: conferencia academica @es
alternative label: prelecção @pt
preferred label: 讲座 @zh
alternative label: lição @pt
alternative label: preleção @pt
alternative label: ponència @ca
preferred label: lezione @it
alternative label: 演讲 @zh
definition: A transcription of a talk delivered during an academic event. @en
preferred label: palestra @pt
in scheme: Resource Types
preferred label: محاضرة @ar
alternative label: лекция
alternative label: disertación @es
alternative label: conferencia magistral @es
alternative label: 演講 @zh
alternative label: disertacion @es
preferred label: ders @tr
alternative label: lectures @en
narrow match: LectureNotes
preferred label: přednáška @cs
narrower: LectureNotes
alternative label: conferencia académica @es
alternative label: 講課 @zh
alternative label: conferencia @es
preferred label: cours magistral @fr
modified: 2018-09-10T18:43:17+00:00

обзорная статья
alternative label: articulo de reseña @es
preferred label: pregledni znanstveni članek @sl
alternative label: article de synthèse @fr
alternative label: recensie-artikel @nl
alternative label: 综述 @zh
preferred label: 综述文章 @zh
alternative label: artículo de reseña @es
editorial note: Published
preferred label: مقال نقد @ar
type: Concept
alternative label: articulo de revision @es
definition: A review article is a secondary source, that is, it is written about other articles, and does not report original research of its own. (adapted from http://apus.libanswers.com/faq/2324) @en
alternative label: 综述评论性论文 @zh
preferred label: Übersichtsartikel @de
in scheme: Resource Types
created: 2016-01-18T14:43:09+00:00
modified: 2019-04-19T20:06:46+00:00
preferred label: artículo de revisión @es
broader: журнальная статья
preferred label: overzichtsartikel @nl
alternative label: 综述论文 @zh
preferred label: přehledový článek @cs
alternative label: derleme makale @tr
alternative label: 综述评论性文章 @zh
preferred label: review article @en
preferred label: レビュー論文 @ja
alternative label: journal commentary @en
alternative label: article de revisió @ca

часть доклада
editorial note: Deprecated
alternative label: parte de una relación @es
broad match: Report
in scheme: Resource Types
preferred label: 报告部分 @zh
preferred label: capítulo de relatório @pt
preferred label: chapitre de rapport @fr
preferred label: capitolo di rapporto tecnico @it
alternative label: 報告部分 @zh
alternative label: reportPart @en
preferred label: parte de un estudio @es
broader: отчёт
modified: 2016-09-05T13:41:43+00:00
preferred label: rapor bölümü @tr
alternative label: partie de rapport @fr
alternative label: parte de un informe @es
type: Concept
preferred label: deelrapport @nl
preferred label: 報告書（部分） @ja
definition: part of a report @en
preferred label: part d'un informe @ca
broader: Report
alternative label: rapportdeel @nl
preferred label: report part @en
alternative label: parte de una relacion @es
alternative label: parte de relatório @pt
preferred label: Teilbericht @de

научное программное обеспечение
broader: программное обеспечение
alternative label: научно-исследовательское программное обеспечение
in scheme: Resource Types
preferred label: software de investigación @es
preferred label: 研究用ソフトウェア @ja
modified: 2019-04-17T21:31:18+00:00
alternative label: исследовательское программное обеспечение
preferred label: research software @en
type: Concept
preferred label: programari acadèmic @ca
alternative label: programari per recerca @ca
alternative label: исследовательское вычислительное программное обеспечение
preferred label: Forschungssoftware @de
alternative label: programari d’anàlisi @ca
preferred label: Araştırma yazılımı @tr
editorial note: Published
definition: Research software (as opposed to simply software) is software that is developed within academia and used for the purposes of research: to generate, process and analyse results. (Adapted from Knowledge Exchange) @en
created: 2018-05-06T17:07:11+00:00
preferred label: raziskovalna programska oprema @sl
preferred label: onderzoekssoftware @nl
preferred label: software per la ricerca @it

клиническое испытание
type: Concept
preferred label: Klinik deney @tr
created: 2018-05-06T17:05:02+00:00
preferred label: klinischer Versuch @de
related: ClinicalTrialReport
alternative label: assaig clínic comparatiu @ca
preferred label: ensayo clínico @es
editorial note: Published
modified: 2019-04-19T19:37:15+00:00
preferred label: klinische trial @nl
preferred label: assaig clínic @ca
preferred label: essai clinique @fr
alternative label: klinično preskušanje @sl
preferred label: klinična raziskava @sl
in scheme: Resource Types
preferred label: saggio clinico @it
alternative label: essai thérapeutique @fr
top concept of: Resource Types
preferred label: 臨床試験 @ja
related match: ClinicalTrialReport
preferred label: clinical trial @en

рецензия на книгу
modified: 2019-04-19T19:35:16+00:00
alternative label: crítica de libro @es
alternative label: аналитический обзор
alternative label: critica de libro @es
preferred label: مراجعة كتاب @ar
broader: Chapter
preferred label: Buchrezension @de
preferred label: book review @en
alternative label: Buchkritik @de
preferred label: boekbespreking @nl
broader: BookItem
preferred label: ressenya de llibre @ca
alternative label: recension de libro @es
preferred label: recenze knihy @cs
alternative label: обзорная статья
alternative label: рецензии на книги
broader: BookSection
alternative label: recensão crítica @pt
preferred label: recensione di libro @it
preferred label: 書評 @ja
alternative label: recension d'ouvrage @fr
type: Concept
alternative label: recensión de libro @es
alternative label: boek review @nl
preferred label: reseña de libro @es
preferred label: recenzija knjige @sl
alternative label: book reviews @en
definition: A written review and critical analysis of the content, scope and quality of a book or other monographic work. @en
broad match: BookSection
alternative label: Buchbesprechung @de
broad match: Chapter
alternative label: recensió de llibre @ca
broad match: BookItem
alternative label: обзоры книг
preferred label: note de lecture @fr
preferred label: kitap eleştirisi @tr
alternative label: نقد كتاب @ar
broader: рецензия
alternative label: comentario de libro @es
in scheme: Resource Types
alternative label: обзор книг
alternative label: crítica de llibre @ca
preferred label: 书评 @zh
alternative label: resenha de livro @pt
alternative label: critique de livre @fr
alternative label: ficha de leitura @pt
preferred label: recensão de livro @pt

общие положения
preferred label: Policy Report @de
preferred label: policy report @en
preferred label: تقرير عن السياسات @ar
preferred label: beleidsrapport @nl
editorial note: Deprecated
preferred label: ポリシーレポート @ja
alternative label: Strategiepapier @de
in scheme: Resource Types
alternative label: Grundsatzpapier @de
alternative label: отчёт о политике
alternative label: informe de actuación @es
preferred label: informativa politica @it
modified: 2019-04-19T20:25:25+00:00
definition: A policy report is a type of report that provides an in-depth look at major policy developments and events [Source: http://www.ifpri.org/topic/global-food-policy-report] @en
preferred label: rapport stratégique @fr
preferred label: relatório de política @pt
broader: отчёт
alternative label: 政策報告 @zh
alternative label: informe sobre políticas @es
alternative label: informe de gestió @ca
preferred label: memoria de actuación @es
preferred label: zpráva k politice nebo strategii @cs
created: 2015-07-17T14:32:55+00:00
preferred label: politika raporu @tr
preferred label: 政策报告 @zh
alternative label: доклад о политике в области развития
type: Concept
preferred label: informe de política @ca
alternative label: informe de gestión @es
alternative label: memoria de protocolo de actuación @es
preferred label: strateško poročilo @sl
alternative label: доклад о политике

технический отчёт
alternative label: reporte técnico @es
preferred label: 技术报告 @zh
alternative label: informe tecnico @es
preferred label: informe técnico @es
type: Concept
alternative label: reporte tecnico @es
preferred label: teknik rapor @tr
preferred label: technisch rapport @nl
preferred label: テクニカルレポート @ja
alternative label: 技術報告 @zh
created: 2015-07-17T14:32:32+00:00
preferred label: rapport technique @fr
preferred label: technischer Bericht @de
broader: отчёт
definition: A technical report is a document that records the procedure adopted and results obtained from a scientific or technical activity or investigation. @en
preferred label: technická zpráva @cs
alternative label: отчёт о техническом состоянии
preferred label: relatório técnico @pt
alternative label: технический доклад
editorial note: Published
preferred label: rapporto tecnico @it
preferred label: تقرير تقني @ar
preferred label: tehnično poročilo @sl
preferred label: informe tècnic @ca
in scheme: Resource Types
preferred label: technical report @en
alternative label: отчёт по техническим вопросам
modified: 2019-04-19T20:03:56+00:00

рабочий процесс
alternative label: документооборот
preferred label: procedura @it
alternative label: поток операций
preferred label: delovni tok @sl
preferred label: سير العمل @ar
alternative label: потоки работ (заданий)
preferred label: flujo de trabajo @es
alternative label: flux de travail @fr
alternative label: информационный поток
alternative label: flux de travaux @fr
preferred label: iş akışı @tr
alternative label: 工作流 @zh
preferred label: workflow @fr
alternative label: последовательность операций
top concept of: Resource Types
preferred label: Workflow @de
alternative label: flux opérationnel @fr
type: Concept
alternative label: cicle de treball @ca
preferred label: fluxo de trabalho @pt
alternative label: flusso di lavoro @it
preferred label: 工作流程 @zh
preferred label: flux de treball @ca
definition: A recorded sequence of connected steps, which may be automated, specifying a reliably repeatable sequence of operations to be undertaken when conducting a particular job, for example an in silico investigation that extracts and processes information from a number of bioinformatics databases. (adapted from http://purl.org/spar/fabio/Workflow) @en
alternative label: Arbeitsablauf @de
modified: 2019-04-11T23:25:33+00:00
preferred label: ワークフロー @ja
preferred label: pracovní postup @cs
alternative label: поточная обработка (заданий)
in scheme: Resource Types

периодическое издание
alternative label: seriale @it
narrower: журнал
preferred label: periodiek @nl
alternative label: 连续出版刊物 @zh
alternative label: periódico @pt
preferred label: periodical @en
alternative label: pubblicazione periodica @it
definition: A periodical is a serial publication with its own distinctive title, characterized by a variety of contents and contributors, and issued at regular intervals. (Adapted from ODLIS) [Source: http://www.abc-clio.com/ODLIS/odlis_p.aspx] @en
preferred label: serijska publikacija @sl
alternative label: časopis @cs
in scheme: Resource Types
alternative label: периодическая пресса
preferred label: périodique @fr
preferred label: süreli yayın @tr
alternative label: fortlaufendes Sammelwerk @de
alternative label: publicação seriada @pt
alternative label: 定期刊物 @zh
alternative label: publicação em série @pt
alternative label: publicació periòdica @ca
preferred label: 期刊 @zh
broader: текстовый ресурс
preferred label: دورية @ar
alternative label: 連續出版刊物 @zh
preferred label: publicación periódica @es
alternative label: периодический журнал
alternative label: publication périodique @fr
alternative label: publicacion seriada @es
alternative label: publicación seriada @es
modified: 2019-04-19T20:00:49+00:00
alternative label: периодика
alternative label: publicacion periodica @es
preferred label: 逐次刊行物 @ja
preferred label: periodikum @cs
preferred label: publicació en sèrie @ca
alternative label: publication en série @fr
broader: Text
narrower: газета
broad match: Text
narrower: периодическое печатное издание
type: Concept
preferred label: Periodikum @de
preferred label: periodico @it
preferred label: publicação periódica @pt

результат проекта
alternative label: livrable de projet @fr
preferred label: مشروع للتسليم @ar
created: 2015-07-17T14:33:20+00:00
broader: отчёт
modified: 2018-09-10T18:43:16+00:00
alternative label: risultato di progetto @it
preferred label: izdelek projekta @sl
preferred label: プロジェクト報告書 @ja
definition: A project deliverable is an “outcome” as a result of a project that is intended to be delivered to a customer (e.g. funder). Examples of deliverable are report, document, work package or any other building block of an overall project. [Source: https://en.wikipedia.org/wiki/Deliverable ] @en
in scheme: Resource Types
preferred label: livrable @fr
alternative label: 項目可交付成果 @zh
type: Concept
alternative label: produto de projeto @pt
alternative label: informes de projectes @ca
preferred label: Ergebnis im Projekt @de
preferred label: výstup projektu @cs
preferred label: project deliverable @en
preferred label: projectresultaat @nl
editorial note: Published
preferred label: deliverable di progetto @it
preferred label: entregable de proyecto @es
alternative label: recensão @pt
alternative label: memoria de proyecto @es
preferred label: entregável de projeto @pt
preferred label: proje çıktısı @tr
preferred label: 项目可交付成果 @zh
preferred label: entrega de projecte @ca
alternative label: результаты проекта
alternative label: resultado de projeto @pt
narrower: план управления данными

постер конференции
alternative label: 會議海報 @zh
broad match: Event
alternative label: 会议墙报 @zh
alternative label: poster de congrès @fr
in scheme: Resource Types
alternative label: poster @it
preferred label: conferentieposter @nl
preferred label: conference poster @en
alternative label: poster de congreso @es
preferred label: ملصق مؤتمر @ar
preferred label: 会議発表ポスター @ja
preferred label: póster de congreso @es
alternative label: стендовый доклад
alternative label: 會議牆報 @zh
preferred label: poster in congresso @it
broad match: Conference
alternative label: póster em congresso @pt
alternative label: poster cientifico @es
alternative label: cartel @es
preferred label: poster de congrés @ca
modified: 2019-04-11T22:49:59+00:00
definition: A conference poster that is submitted to a conference and presented there at a poster presentation. The conference poster is published in proceedings. @en
preferred label: poster na konferenci @cs
alternative label: póster científico @es
broader: сборник материалов конференции
preferred label: póster em conferência @pt
preferred label: poster dans une conférence @fr
type: Concept
alternative label: плакат конференции
alternative label: ملصق @ar
alternative label: poster de conférence @fr
preferred label: 会议海报 @zh
alternative label: póster @pt
preferred label: Konferenzposter @de
preferred label: konferans posteri @tr

неопубликованный доклад конференции
alternative label: comunicação não publicada nas atas do congresso @pt
type: Concept
editorial note: Proposed deprecated
definition: A conference paper that is submitted to a conference and presented to the audience. The conference paper is not published in proceedings. [Source: http://academia.stackexchange.com/questions/18349/difference-between-conference-paper-and-journal-paper ] @en
alternative label: неопубликованные доклады конференции
preferred label: 未发表在会议论文集中的文章 @zh
preferred label: comunicació no publicada en actes de congrés @ca
alternative label: неопубликованные работы конференции
alternative label: artigo não publicado nas atas da conferência @pt
alternative label: conferencepaper not in proceedings @en
in scheme: Resource Types
preferred label: konferenční příspěvek nezahrnutý ve sborníku @cs
preferred label: comunicação não publicada nas atas da conferência @pt
created: 2015-07-17T14:27:22+00:00
preferred label: Konferenzbeitrag nicht im Tagungsband @de
preferred label: 会議発表論文（会議録未掲載） @ja
preferred label: neobjavljen članek na konferenci @sl
preferred label: conference paper not in proceedings @en
preferred label: article dans une conférence non publié dans les actes @fr
preferred label: conferentie artikel niet in proceedings @nl
alternative label: 未發表在會議論文集中的文章 @zh
alternative label: artigo não publicado nas atas do congresso @pt
preferred label: comunicazione non pubblicata in atti di congresso @it
preferred label: yayınlanmamış konferans bildirisi @tr
modified: 2018-09-10T18:43:29+00:00
alternative label: неопубликованные доклады конференций
broader: материалы конференции
preferred label: comunicación no publicada en actas de congreso @es
alternative label: article de conférence non publié dans les actes @fr
alternative label: неопубликованные материалы конференции

вклад в журнал
in scheme: Resource Types
preferred label: contributo in rivista @it
preferred label: 学術雑誌掲載記事 @ja
alternative label: مقال في دورية @ar
preferred label: Zeitschriftenbeitrag @de
alternative label: статья для журнала
narrower: редакционная статья
modified: 2019-04-17T21:31:16+00:00
alternative label: artículo de boletín @es
preferred label: tijdschrift bijdrage @nl
alternative label: articolo in rivista @it
alternative label: artículo de revista @es
preferred label: contributo em revista @pt
alternative label: статья в периодическом издании
alternative label: articulo de revista @es
alternative label: публикация
preferred label: prispevek v reviji @sl
narrower: журнальная статья
alternative label: журнальная публикация
preferred label: contribution à un journal @fr
type: Concept
alternative label: статьи для журнала
preferred label: příspěvek v časopisu @cs
alternative label: журнальные статьи
alternative label: artículo de prensa @es
alternative label: 期刊文獻 @zh
preferred label: contribution to journal @en
preferred label: contribución a revista @es
preferred label: 期刊文献 @zh
preferred label: مساهمة في دورية @ar
broader: журнал
alternative label: научные статьи
preferred label: contribució a revista @ca
alternative label: articulo de prensa @es
alternative label: 期刊论文 @zh
narrower: письмо редактору
definition: A contribution to a journal denotes a work published in a journal. If applicable sub-terms should be chosen. @en

интервью
created: 2018-05-06T16:42:34+00:00
alternative label: Röportaj @tr
preferred label: Interview @de
preferred label: インタビュー @ja
type: Concept
preferred label: intervista @it
preferred label: Görüşme @tr
definition: A discussion between a reporter, host, panel, or audience and a newsmaker, author, or celebrity, recorded (edited or unedited) in print, on film or video, as transcript or as a sound recording. (Adapted from ODLIS) @en
broader: набор данных
preferred label: interview @nl
alternative label: беседа
alternative label: репортаж
editorial note: Published
narrower: interview
preferred label: entrevista @ca
in scheme: Resource Types
narrow match: interview
narrower: Text Interview
alternative label: interviu @ca
narrow match: Broadcast Interview
alternative label: Mülakat @tr
alternative label: опрос
modified: 2019-04-19T19:47:51+00:00
narrower: Broadcast Interview
narrow match: Text Interview
preferred label: intervju @sl

письмо редактору
alternative label: письмо в редакцию
alternative label: бюллетень
definition: A letter to the editor is a letter sent to a periodical about issues of concern from its readers. (adapted from Wikipedia) [Source: http://dspacecris.eurocris.org/cris/classcerif/classcerif00429] @en
alternative label: carta al director de revista @es
preferred label: letter to the editor @en
preferred label: pismo uredniku @sl
alternative label: carta al editor @es
preferred label: carta al director @ca
preferred label: dopis redakci @cs
modified: 2018-09-03T14:38:37+00:00
alternative label: письмо редактору журнала
alternative label: folleto @es
preferred label: lettera al direttore @it
preferred label: lettre à l'éditeur @fr
alternative label: gacetilla @es
preferred label: رسالة الى المحرر @ar
alternative label: gaceta @es
alternative label: carta ao diretor @pt
alternative label: письма в редакцию
alternative label: bulletin @fr
preferred label: 读者来信 @zh
alternative label: carta al editor de revista @es
alternative label: 快報 @zh
alternative label: письма журнала
preferred label: Leserbrief @de
preferred label: ingezonden brief @nl
alternative label: boletin @es
broader: вклад в журнал
type: Concept
alternative label: информационный бюллетень
in scheme: Resource Types
alternative label: 快报 @zh
preferred label: 来信 @ja
alternative label: newsletter @fr
preferred label: carta ao editor @pt
alternative label: boletín @es
alternative label: comunicazione in rivista @it
alternative label: 讀者來信 @zh
alternative label: письма в журнал

препринт
broad match: Document
modified: 2019-04-19T20:02:10+00:00
preferred label: Preprint @de
alternative label: Vorabdruck @de
preferred label: publicació preliminar @ca
preferred label: プレプリント @ja
preferred label: preprint @pt
broader: текстовый ресурс
preferred label: ön baskı @tr
alternative label: сигнальный экземпляр
alternative label: préprint @fr
alternative label: artículo sin revisión por pares @es
editorial note: Deprecated
broad match: Text
alternative label: articulo preliminar @es
alternative label: artigo preliminar @pt
type: Concept
broader: Document
alternative label: voordruk @nl
alternative label: borrador @es
alternative label: prepublicación @es
alternative label: artigo sem revisão @pt
preferred label: artículo preliminar @es
alternative label: 先印本 @zh
broader: Text
preferred label: prépublication @fr
alternative label: pré-publication @fr
preferred label: 预印本 @zh
alternative label: препринт статьи
alternative label: articulo sin revision por pares @es
preferred label: articolo preliminare @it
alternative label: pré-print @fr
in scheme: Resource Types
definition: Pre-print describes the first draft of the article - before peer-review, even before any contact with a publisher. This use is common amongst academics for whom the key modification of an article is the peer-review process. Another use of the term pre-print is for the finished article, reviewed and amended, ready and accepted for publication - but separate from the version that is type-set or formatted by the publisher. This use is more common amongst publishers, for whom the final and significant stage of modification to an article is the arrangement of the material for putting to print. [Source: http://www.sherpa.ac.uk/romeoinfo.html ] @en
alternative label: предпечатная версия публикации

периодическое печатное издание
preferred label: Magazin @tr
created: 2018-05-06T17:01:35+00:00
in scheme: Resource Types
preferred label: magazine @en
alternative label: časnik @sl
alternative label: revista de divulgación @es
editorial note: Published
modified: 2019-04-19T19:51:33+00:00
alternative label: revista de divulgacion @es
alternative label: časopis @sl
preferred label: revista de divulgació @ca
preferred label: rivista divulgativa @it
type: Concept
alternative label: издание
alternative label: revista de divulgación científica @es
alternative label: revista de divulgacion cientifica @es
broader: периодическое издание
preferred label: 雑誌 @ja
preferred label: revista divulgativa @es
preferred label: Informationszeitschrift @de
alternative label: журнал
definition: A popular interest periodical usually containing articles on a variety of topics, written by various authors in a nonscholarly style or a trade publication, unlike a consumer publication, covers a specific topic for people who work in that particular field or industry. Adapted from https://www.thebalance.com/what-is-a-trade-publication-exactly-2316039 and http://www.abc-clio.com/ODLIS/odlis_m.aspx @en
preferred label: tijdschrift @nl
preferred label: informativna revija @sl
alternative label: брошюра

опечатка
created: 2018-05-06T16:49:49+00:00
preferred label: 正誤表 @ja
alternative label: ошибка
alternative label: поправки
in scheme: Resource Types
alternative label: fe de erratas @es
preferred label: corrigendum @en
alternative label: исправление орфографических ошибок и опечаток
definition: A formal correction to an error introduced by the author into a previously published document. (adapted from https://sparontologies.github.io/fabio/current/fabio.html#d4e2712) @en
alternative label: исправление
broader: Correction
broad match: Correction
preferred label: Korrigendum @de
preferred label: popravek članka @sl
alternative label: исправленная опечатка
related: Erratum
related match: Erratum
alternative label: поправка
alternative label: описка
alternative label: fe d'errates @ca
preferred label: corrigenda @es
alternative label: список опечаток
broader: журнальная статья
type: Concept
modified: 2019-04-19T19:26:44+00:00
preferred label: correcció d’errors @ca
alternative label: список опечаток и исправлений
preferred label: erratum @fr
alternative label: correcció @ca
alternative label: Berichtigung @de
editorial note: Published

клиническое исследование
alternative label: klinisch onderzoek @nl
preferred label: klinische Studie @de
editorial note: Published
created: 2018-05-06T17:05:22+00:00
related: ClinicalCaseReport
alternative label: 臨床研究 @ja
in scheme: Resource Types
modified: 2019-04-19T19:36:43+00:00
top concept of: Resource Types
preferred label: klinična študija @sl
preferred label: clinical study @en
preferred label: studio clinico @it
preferred label: klinische studie @nl
preferred label: estudi clínic @ca
preferred label: Klinik çalışması @tr
preferred label: estudio clínico @es
related match: ClinicalCaseReport
preferred label: étude clinique @fr
alternative label: essai clinique @fr
type: Concept

прочее
preferred label: otros @es
definition: A rest category which may cover text, interactive, sound, or image-based resources not explicitly addressed in any concept in this vocabulary @en
preferred label: outros @pt
alternative label: прочие документы
preferred label: anders @nl
preferred label: ostalo @sl
preferred label: autre @fr
in scheme: Resource Types
top concept of: Resource Types
preferred label: ostatní @cs
type: Concept
alternative label: 其它 @zh
preferred label: other @en
preferred label: その他 @ja
preferred label: altres @ca
alternative label: другое
preferred label: altro @it
alternative label: прочие издания
alternative label: прочие ресурсы
related: Outputs - Other
related match: Outputs - Other
modified: 2019-04-19T19:59:26+00:00
preferred label: 其他 @zh
preferred label: آخر @ar
preferred label: diğer @tr
preferred label: sonstige @de

библиография
broader: текстовый ресурс
preferred label: bibliografie @cs
preferred label: bibliografia @it
definition: Систематизированный перечень или список письменных работ/источников конкретного автора или на заданную тему.
preferred label: بيبليوغرافيا @ar
alternative label: 书目 @zh
in scheme: Resource Types
preferred label: bibliografía @es
preferred label: bibliography @en
modified: 2018-09-10T18:43:16+00:00
alternative label: список литературы
broader: Text
preferred label: Bibliografie @de
preferred label: bibliografija @sl
alternative label: 文獻目錄 @zh
definition: A systematic list or enumeration of written works by a specific author or on a given subject. @en
preferred label: 文献目录 @zh
alternative label: přehled literatury @cs
alternative label: bibliyografya @tr
preferred label: 書誌 @ja
preferred label: kaynakça @tr
alternative label: справочные материалы
alternative label: библиографический список
preferred label: bibliographie @fr
alternative label: список рекомендуемой литературы
alternative label: 書目 @zh
broad match: Text
alternative label: список использованных источников
alternative label: لائحة مراجع @ar
type: Concept

финансовый отчёт
alternative label: poročilo financerjem projekta @sl
alternative label: rapport au financeur @fr
preferred label: zpráva pro poskytovatele podpory @cs
editorial note: Deprecated
alternative label: rapportage voor financier @nl
preferred label: rapporto a un'agenzia di finanziamento @it
created: 2015-07-17T14:33:55+00:00
preferred label: rapport à l'intention du financeur @fr
alternative label: končno poročilo o rezultatih raziskav @sl
broader: отчёт
preferred label: relatório para organismo financiador @pt
alternative label: reporte a agencia de financiamento @es
modified: 2019-04-19T20:25:23+00:00
definition: A report to a funding agency is a document written by beneficiaries of project grants. The reporting documents can be e.g. periodic reports about progress of scientific and technical work and final report. For deliverables use ‘Project deliverable’. [Source: http://ec.europa.eu/research/participants/fp7documents/funding-guide/6_projects/reports/reports_en.htm ] @en
alternative label: отчёт об исполнении плана финансирования
alternative label: отчёты о финансировании
preferred label: 助成研究成果報告書 @ja
preferred label: fon sağlayıcıya rapor @tr
alternative label: informe a agencia financiadora @es
alternative label: relatório para agência de financiamento @pt
preferred label: report to funding agency @en
alternative label: 給資助機構的報告 @zh
preferred label: poročilo financerjem raziskave @sl
alternative label: отчёт о финансовых результатах
in scheme: Resource Types
preferred label: 给资助机构的报告 @zh
alternative label: отчёты по финансированию
preferred label: Bericht an Förderorganisation @de
preferred label: informe per una agència de finançament @ca
alternative label: relatório para financiador @pt
preferred label: informe a organismo financiador @es
preferred label: تقرير لوكالة تمويل @ar
type: Concept
alternative label: финансовая отчётность

статическое изображение
alternative label: imagem fixa @pt
alternative label: графический документ
alternative label: afbeelding @nl
alternative label: графическое изображение
alternative label: статичное изображение
alternative label: фотография
preferred label: still image @en
alternative label: неподвижный кадр
preferred label: stilstaandbeeld @nl
type: Concept
alternative label: графический дизайн
alternative label: план
alternative label: фотодокумент
broad match: Image
alternative label: фотографический документ
broader: изображение
alternative label: 靜止圖像 @zh
preferred label: 静态图像 @zh
preferred label: Einzelbild @de
alternative label: фотоснимок
preferred label: statična vizualna predstavitev @sl
preferred label: imagem estática @pt
alternative label: картина
preferred label: 静止画 @ja
preferred label: imagen fija @es
modified: 2019-04-19T20:08:39+00:00
preferred label: imatge fixa @ca
alternative label: imagem @pt
preferred label: immagine fissa @it
alternative label: рисунок
preferred label: image fixe @fr
in scheme: Resource Types
definition: A recorded static visual representation. This class of image includes diagrams, drawings, graphs, graphic designs, plans, photographs and prints. @en
preferred label: صورة ثابته @ar
alternative label: 靜態圖像 @zh
alternative label: неподвижное изображение
alternative label: 静止图像 @zh
preferred label: nepohyblivý obraz @cs
broader: Image
preferred label: hareketsiz görüntü @tr
alternative label: фотографическое изображение

газетная статья
alternative label: редакционная статья
alternative label: газетное сообщение
alternative label: газетное объявление
preferred label: Gazete kupürü @tr
preferred label: article de journal @fr
alternative label: artículo de diario @es
preferred label: newspaper article @en
alternative label: articulo de periodico @es
alternative label: газетная публикация
alternative label: Gazete yazısı @tr
preferred label: artículo de periódico @es
in scheme: Resource Types
preferred label: članek v časopisu @sl
modified: 2019-04-19T19:58:05+00:00
preferred label: Zeitungsartikel @de
definition: Work consisting of a news item appearing in a general-interest newspaper or other general news periodical, containing information of current and timely interest in a field. (Adapted from http://www.reference.md/files/D018/mD018431.html ) @en
preferred label: articolo di giornale @it
type: Concept
created: 2018-05-06T16:59:57+00:00
broader: газета
alternative label: article de periòdic @ca
alternative label: articulo de diario @es
broader: Article
broad match: Article
preferred label: 新聞記事 @ja
preferred label: krantenartikel @nl
editorial note: Published
preferred label: article de diari @ca

научная статья
in scheme: Resource Types
type: Concept
alternative label: исследовательская статья
definition: A research article is a primary source, that is, it reports the methods and results of an original study performed by the authors. (adapted from http://apus.libanswers.com/faq/2324) @en
preferred label: 原创研究文章 @zh
alternative label: articulo de investigacion @es
alternative label: artículo científico @es
alternative label: artículo de investigación @es
editorial note: Published
modified: 2018-09-10T18:39:51+00:00
preferred label: research article @en
alternative label: article de recherche @fr
preferred label: původní článek @cs
preferred label: 原著論文 @ja
alternative label: articulo original @es
alternative label: публикация в научном журнале
preferred label: artículo original @es
preferred label: onderzoeksartikel @nl
preferred label: araştırma makalesi @tr
broader: журнальная статья
created: 2016-01-18T14:43:28+00:00
preferred label: znanstveni članek @sl
alternative label: articulo cientifico @es
preferred label: مقال بحث @ar
preferred label: Forschungsartikel @de
alternative label: 原创研究论文 @zh

газета
preferred label: krant @nl
modified: 2019-04-19T19:56:46+00:00
preferred label: periódico @es
created: 2018-05-06T16:58:27+00:00
alternative label: многотиражка
definition: A newspaper is a printed publication (usually issued daily or weekly) consisting of folded unstapled sheets and containing news, articles, advertisements, and correspondence. (Adapted from oxforddictionaries) @en
alternative label: časnik @sl
preferred label: 新聞 @ja
preferred label: newspaper @en
in scheme: Resource Types
type: Concept
preferred label: Zeitung @de
preferred label: giornale @it
narrower: газетная статья
preferred label: diari @ca
preferred label: journal @fr
alternative label: diario @es
editorial note: Published
broader: периодическое издание
preferred label: časopis @sl
preferred label: Gazete @tr

рукопись
alternative label: манускрипт
preferred label: 手稿 @ja
definition: A manuscript is a work of any kind (text, inscription, music score, map, etc.) written entirely by hand. (Adapted from ODLIS) @en
alternative label: El yazması @tr
alternative label: handschrift @nl
preferred label: Manuskript @de
created: 2018-05-06T16:55:45+00:00
alternative label: rokopis @sl
type: Concept
broader: текстовый ресурс
preferred label: manuscrit @fr
alternative label: document original @ca
preferred label: manoscritto @it
preferred label: Yazma eser @tr
preferred label: manuscript @nl
editorial note: Published
preferred label: manuscrito @es
in scheme: Resource Types
modified: 2019-04-17T21:31:29+00:00

Resource Types
modified: 2021-03-24T19:45:19+00:00
has top concept: фонодокумент
has top concept: изображение
has top concept: текстовый ресурс
type: ConceptScheme
has top concept: рабочий процесс
has top concept: учебный объект
has top concept: набор данных
has top concept: клиническое испытание
has top concept: клиническое исследование
has top concept: интерактивный ресурс
has top concept: программное обеспечение
has top concept: прочее
has top concept: картографические ресурсы
description: The Resource Type vocabulary defines concepts to identify the genre of a resource. Such resources, like publications, research data, audio and video objects, are typically deposited in institutional and thematic repositories or published in ejournals. This vocabulary supports a hierarchical model that relates narrower and broader concepts. Multilingual labels regard regional distinctions in language and term. Concepts of this vocabulary are mapped with terms and concepts of similar vocabularies and dictionaries.
creator: Brigit Nonó
creator: Cristina Azorín
creator: Gültekin Gürdal
creator: Hilary Jones
creator: Holt, Ilkay
creator: Iryna Solodovnik
creator: Isabel Bernal
creator: Jochen Schirrwagen
creator: Ku (Alan) Liping
creator: Laurence Le Borgne
creator: Marina Losada
creator: Milan Ojsteršek
creator: Nathalie Vedovotto
creator: Nie Hua
creator: Paola Azrilevich
creator: Pedro Príncipe
creator: Sawsan Habre
creator: Susanna Mornati
creator: Tomoko Kataoka
creator: Wilko Steinhoff
creator: Yutaka Hayashi
contributor: COAR Controlled Vocabularies Interest Group