kartografska građa
preferred label: matériel cartographique @fr
narrower: мапа
preferred label: kartografsko gradivo @sl
preferred label: kartografický dokument @cs
preferred label: material cartográfico @es
editorial note: Published @en
in scheme: Resource Types
alternative label: material cartografico @es
preferred label: kartografik malzeme @tr
preferred label: kartographisches Material @de
alternative label: kartografski material @sl
preferred label: cartografisch materiaal @nl
preferred label: картографический материал @ru
preferred label: 地図資料 @ja
preferred label: cartographic material @en
alternative label: картографски материјал
type: Concept
alternative label: kartografski materijal
alternative label: materiale cartografico @it
definition: Any material representing the whole or part of the earth or any celestial body at any scale. Cartographic materials include two- and three-dimensional maps and plans (including maps of imaginary places); aeronautical, navigational, and celestial charts; atlases; globes; block diagrams; sections; aerial photographs with a cartographic purpose; bird's-eye views (map views), etc. [Source: http://www.loc.gov/marc/cfmap.html] @en
preferred label: cartografia @it
preferred label: kartografinen aineisto @fi
alternative label: 地圖類資料 @zh
preferred label: 地图类资料 @zh
preferred label: картографска грађа
preferred label: مادة خرائطية @ar
preferred label: material cartogràfic @ca
top concept of: Resource Types

извештај
alternative label: relacion @es
preferred label: report @en
preferred label: 報告書 @ja
preferred label: rapor @tr
preferred label: informe @es
alternative label: reports @en
narrower: технички извештај
narrower: mémo
alternative label: memoria @es
narrower: резултат пројекта
alternative label: paper @en
preferred label: Bericht @de
preferred label: relatório @pt
preferred label: raportti @fi
definition: A report is a separately published record of research findings, research still in progress, policy developments and events, or other technical findings, usually bearing a report number and sometimes a grant number assigned by the funding agency. Also, an official record of the activities of a committee or corporate entity, the proceedings of a government body, or an investigation by an agency, whether published or private, usually archived or submitted to a higher authority, voluntarily or under mandate. In a more general sense, any formal account of facts or information related to a specific event or phenomenon, sometimes given at regular intervals. [Source: http://lu.com/odlis/odlis_R.cfm#report ] @en
preferred label: отчет @ru
preferred label: تقرير @ar
preferred label: izveštaj
narrower: протокол истраживања
preferred label: 报告 @zh
alternative label: relación @es
alternative label: reporte @es
preferred label: poročilo @sl
narrower: analiza politike
narrower: извештај о истраживању
alternative label: 调研报告 @zh
preferred label: rapport @fr
alternative label: estudio @es
preferred label: zpráva @cs
alternative label: 科研报告 @zh
narrower: klinička studija
in scheme: Resource Types
alternative label: 研究报告 @zh
type: Concept
alternative label: estudi @ca
alternative label: 報告 @zh
broad match: Text
narrower: plan upravljanja podacima
preferred label: rapporto @it
broader: tekst

препринт
alternative label: Vorabdruck @de
editorial note: Deprecated @en
preferred label: artículo preliminar @es
preferred label: preprint
preferred label: プレプリント @ja
in scheme: Resource Types
alternative label: prepublicación @es
preferred label: publicació preliminar @ca
preferred label: articolo preliminare @it
broad match: Text
alternative label: articulo preliminar @es
broader: tekst
alternative label: 先印本 @zh
preferred label: prépublication @fr
type: Concept
alternative label: articulo sin revision por pares @es
alternative label: voordruk @nl
alternative label: borrador @es
alternative label: artigo preliminar @pt
preferred label: ön baskı @tr
definition: A preprint is a scientific manuscript without peer-review and has not yet been accepted by a journal, typicaly submitted to a public server/ repository by the author. [Source: Adapted from https://asapbio.org/preprint-info/preprint-faq#qaef-637] @en
preferred label: 预印本 @zh
preferred label: Preprint @de
alternative label: artigo sem revisão @pt
alternative label: préprint @fr
alternative label: artículo sin revisión por pares @es

računarski program
alternative label: 软体 @zh
preferred label: ohjelmisto @fi
preferred label: yazılım @tr
alternative label: programa informatico @es
alternative label: programa informático @es
preferred label: 软件 @zh
alternative label: programme informatique @fr
alternative label: 軟件 @zh
preferred label: برنامج حاسوب @ar
alternative label: برنامج كمبيوتر @ar
definition: A computer program in source code (text) or compiled form. [Source: http://purl.org/dc/dcmitype/Software] @en
preferred label: software @es
alternative label: softver
top concept of: Resource Types
broad match: cop
alternative label: софтвер
alternative label: programma informatico @it
narrower: izvorni softverski kod
preferred label: programska oprema @sl
alternative label: développement informatique @fr
preferred label: Software @de
broad match: SoftwareApplication
preferred label: программное обеспечение @ru
in scheme: Resource Types
alternative label: 軟體 @zh
alternative label: programa de computador @pt
preferred label: logiciel @fr
preferred label: programari @ca
alternative label: programa informàtic @ca
alternative label: počítačový program @cs
preferred label: рачунарски програм
preferred label: ソフトウェア @ja
narrower: софтвер за науку
type: Concept

pokretne slike
definition: A moving display, either generated dynamically by a computer program or formed from a series of pre-recorded still images imparting an impression of motion when shown in succession. [Source: http://purl.org/spar/fabio/MovingImage] @en
preferred label: hareketli görüntü @tr
alternative label: imagen dinamica @es
preferred label: 运动图像 @zh
preferred label: imagen dinámica @es
broader: slika
preferred label: imagem animada @pt
alternative label: سمعي بصري @ar
alternative label: imagem em movimento @pt
preferred label: image animée @fr
alternative label: 动画 @zh
preferred label: покретне слике
alternative label: 運動圖像 @zh
narrower: video
preferred label: 動画 @ja
alternative label: audiovisual @en
preferred label: движущееся изображение @ru
type: Concept
preferred label: Bewegte Bilder @de
preferred label: pohyblivý obraz @cs
alternative label: imagen en movimiento @es
preferred label: gibljiva slika @sl
in scheme: Resource Types
preferred label: صورة متحركة @ar
preferred label: filmmateriaal @nl
alternative label: 動畫 @zh
preferred label: immagine dinamica @it
preferred label: liikkuva kuva @fi
preferred label: imatge en moviment @ca
preferred label: moving image @en

slika
top concept of: Resource Types
narrower: pokretne slike
preferred label: afbeelding @nl
alternative label: figura @es
preferred label: изображение @ru
preferred label: слика
alternative label: beeldmateriaal @nl
preferred label: immagine @it
preferred label: 图像 @zh
alternative label: 图片 @zh
alternative label: 圖片 @zh
narrow match: StillImage
alternative label: vizualna upodobitev @sl
alternative label: imaj @tr
preferred label: Bild @de
alternative label: визуелни приказ
alternative label: 影像 @zh
preferred label: görüntü @tr
type: Concept
in scheme: Resource Types
preferred label: obraz @cs
preferred label: image @en
broad match: MediaObject
preferred label: صورة @ar
preferred label: imatge @ca
alternative label: 圖像 @zh
preferred label: imagem @pt
narrower: statična slika
preferred label: イメージ @ja
preferred label: test @hu
alternative label: vizuelni prikaz
definition: A visual representation other than text, including all types of moving image and still image. [Source: Adapted from http://purl.org/dc/dcmitype/Image] @en
preferred label: imagen @es
preferred label: kuva @fi

писмо уреднику
alternative label: comunicazione in rivista @it
preferred label: carta ao editor @pt
alternative label: carta al editor @es
alternative label: bulletin @fr
preferred label: kirje päätoimittajalle @fi
alternative label: 快报 @zh
preferred label: 来信 @ja
alternative label: 快報 @zh
alternative label: 讀者來信 @zh
alternative label: gacetilla @es
alternative label: carta ao diretor @pt
alternative label: boletín @es
preferred label: pismo uredniku
alternative label: pismo uredništvu
alternative label: boletin @es
preferred label: carta al director @ca
preferred label: Leserbrief @de
alternative label: carta al editor de revista @es
preferred label: letter to the editor @en
preferred label: lettera al direttore @it
definition: A letter addressed to the editor and comments on or discussed an item previously published by that periodical, or of interest to its readership. [Source: Adapted from http://purl.org/spar/fabio/Letter] @en
alternative label: gaceta @es
preferred label: رسالة الى المحرر @ar
preferred label: dopis redakci @cs
preferred label: ingezonden brief @nl
broader: часопис
alternative label: folleto @es
alternative label: newsletter @fr
alternative label: писмо уредништву
preferred label: lettre à l'éditeur @fr
preferred label: 读者来信 @zh
alternative label: pismo redakciji
alternative label: писмо редакцији
in scheme: Resource Types
preferred label: письмо редактору @ru
type: Concept
alternative label: carta al director de revista @es

чланак о рачунарском програму
definition: A software paper should include the rationale for the development of the tool and details of the code used for its construction. [Source: Adapted from https://f1000research.com/for-authors/article-guidelines/software-tool-articles ] @en
alternative label: article sur un logiciel @fr
preferred label: artículo de software @es
editorial note: Published @en
preferred label: descripció de programari @ca
in scheme: Resource Types
alternative label: članak o softveru
preferred label: статья по программному обеспечению @ru
preferred label: članak o računarskom programu
alternative label: опис софтвера
preferred label: software paper @en
alternative label: чланак о софтверу
preferred label: članek o programski opremi @sl
broader: чланак у часопису
alternative label: опис рачунарског програма
alternative label: opis softvera
alternative label: opis računarskog programa
type: Concept
alternative label: article sobre programari @ca
preferred label: ohjelmistoa kuvaava artikkeli @fi
preferred label: software artikel @nl
preferred label: ソフトウェア論文 @ja
alternative label: software tool article @en
alternative label: article décrivant un logiciel @fr
preferred label: Softwareartikel @de
alternative label: opis programske opreme @sl

periodična publikacija
preferred label: periodical @en
alternative label: серијска публикација
preferred label: periodico @it
top concept of: Resource Types
preferred label: 逐次刊行物 @ja
alternative label: publicação seriada @pt
alternative label: pubblicazione periodica @it
alternative label: fortlaufendes Sammelwerk @de
alternative label: publicación seriada @es
alternative label: publicacion seriada @es
preferred label: serijska publikacija
preferred label: 期刊 @zh
alternative label: 連續出版刊物 @zh
preferred label: периодична публикација
alternative label: publication périodique @fr
alternative label: 连续出版刊物 @zh
alternative label: publicació periòdica @ca
alternative label: periodika
preferred label: periodikum @cs
broad match: Text
preferred label: périodique @fr
alternative label: seriale @it
definition: A periodical is a serial publication with its own distinctive title, characterized by a variety of contents and contributors, and issued at regular intervals. (Adapted from ODLIS) [Source: http://www.abc-clio.com/ODLIS/odlis_p.aspx] @en
preferred label: publicación periódica @es
alternative label: publicacion periodica @es
preferred label: periodiek @nl
in scheme: Resource Types
preferred label: süreli yayın @tr
type: Concept
preferred label: publicação periódica @pt
alternative label: publication en série @fr
alternative label: časopis @cs
alternative label: 定期刊物 @zh
preferred label: Periodikum @de
alternative label: периодика
expires: 2021-03-12
alternative label: periódico @pt
alternative label: publicação em série @pt
preferred label: publicació en sèrie @ca

muzička kompozicija
alternative label: pieza de musica @es
alternative label: obra de musica @es
editorial note: Published @en
alternative label: composicion musical @es
alternative label: obra de música @es
in scheme: Resource Types
preferred label: hudební skladba @cs
alternative label: قطعة موسيقية @ar
type: Concept
preferred label: 音楽 @ja
preferred label: تأليف موسيقي @ar
preferred label: composição musical @pt
alternative label: pieza de música @es
alternative label: pieza musical @es
alternative label: obra musical @es
preferred label: composition musicale @fr
preferred label: composición musical @es
preferred label: muzikale compositie @nl
alternative label: partitura @ca
preferred label: музыкальное произведение @ru
preferred label: musical composition @en
preferred label: müzikal kompozisyon @tr
preferred label: composició musical @ca
alternative label: 音樂 @zh
broader: zvučni zapis
preferred label: skladba @sl
alternative label: Tonsatz @de
alternative label: hudební kompozice @cs
preferred label: musikalische Komposition @de
preferred label: composizione musicale @it
preferred label: 音乐 @zh
alternative label: 音樂作品 @zh
definition: Musical composition can refer to an original piece of music, the structure of a musical piece, or the process of creating a new piece of music. [Source: https://en.wikipedia.org/wiki/Musical_composition ] @en
preferred label: sävellys @fi
alternative label: 音乐作品 @zh
preferred label: музичка композиција
alternative label: glasbeno delo @sl

plan upravljanja podacima
preferred label: plano de gestão de dados @pt
preferred label: data management plan @en
preferred label: データ管理計画 @ja
preferred label: datanhallintasuunnitelma @fi
preferred label: piano di gestione dei dati @it
definition: A formal statement describing how research data will be managed and documented throughout a research project and the terms regarding the subsequent deposit of the data with a data repository for long-term management and preservation. [Source: https://casrai.org/rdm-glossary] @en
type: Concept
preferred label: план управления данными @ru
alternative label: pla d’administració de dades @ca
alternative label: načrt upravljanja s podatki @sl
editorial note: Published @en
preferred label: načrt ravnanja s podatki @sl
in scheme: Resource Types
preferred label: Datenmanagementplan @de
preferred label: pla de gestió de dades @ca
preferred label: план управљања подацима
broader: извештај
preferred label: plan de gestion de données @fr
preferred label: plan de gestión de datos @es

radni dokument
preferred label: documento de trabajo @es
in scheme: Resource Types
alternative label: préprint @fr
alternative label: documento de trabalho de investigação @pt
preferred label: 研究手稿 @zh
broad match: Text
alternative label: document de travail @fr
preferred label: радни документ
alternative label: ön makale @tr
alternative label: 未發表論文 @zh
preferred label: рабочий документ @ru
type: Concept
alternative label: documento de reflexão @pt
preferred label: pracovní dokument @cs
alternative label: memorando de investigação @pt
preferred label: ワーキングペーパー @ja
preferred label: working paper @pt
alternative label: discussion paper @en
definition: A working or discussion paper circulated publicly or among a group of peers. Certain disciplines, for example economics, issue working papers in series. [Source: http://www.ukoln.ac.uk/repositories/digirep/index/Eprints_Type_Vocabulary_Encoding_Scheme#:~:text=http%3A//purl.org/eprint/type/WorkingPaper] @en
alternative label: papier de travail @fr
alternative label: prepublicació @ca
alternative label: werkdocument @nl
alternative label: 工作底稿 @zh
alternative label: documento de trabalho @pt
alternative label: working or discussion paper @en
preferred label: ورقة عمل @ar
alternative label: çalışma belgesi @tr
preferred label: Arbeitspapier @de
preferred label: ön rapor @tr
preferred label: document de treball @ca
preferred label: delovna verzija članka @sl
alternative label: documento di lavoro @it
broader: tekst
alternative label: 未发表论文 @zh
alternative label: ورقة مناقشة @ar
preferred label: työpaperi @fi
alternative label: working papers @en
alternative label: borrador de trabajo @es

техничка документација
definition: Technical documentation refers to any type of documentation that describes handling, functionality and architecture of a technical product or a product under development or use. [Source: https://en.wikipedia.org/wiki/Technical_documentation] @en
broad match: Text
broader: tekst
alternative label: 技術文獻 @zh
preferred label: manuel technique @fr
type: Concept
alternative label: Technische Unterlagen @de
alternative label: documentacion tecnica @es
alternative label: 技術文檔 @zh
preferred label: technische documentatie @nl
preferred label: وثائق تقنية @ar
preferred label: 技術文書 @ja
alternative label: manual técnico @pt
preferred label: Technische Dokumentation @de
alternative label: manuale tecnico @it
alternative label: 技术文献 @zh
broad match: Document
preferred label: documentació tècnica @ca
alternative label: 技術資料 @zh
preferred label: technical documentation @en
preferred label: technická dokumentace @cs
preferred label: tehnična dokumentacija @sl
preferred label: tehnička dokumentacija
alternative label: 技术文档 @zh
alternative label: documentation technique @fr
preferred label: teknik dokümantasyon @tr
preferred label: documentación técnica @es
preferred label: tekninen dokumentaatio @fi
alternative label: manual @es
preferred label: техническая документация @ru
in scheme: Resource Types
alternative label: كتيب @ar
preferred label: documentação técnica @pt
preferred label: 技术资料 @zh
preferred label: documentazione tecnica @it

патентирана сорта
alternative label: brevet végétal @fr
preferred label: kwekersrecht @nl
broader: patent
preferred label: brevetto di pianta @it
preferred label: патент на растение @ru
preferred label: brevet de plante @fr
preferred label: rastlinska sorta @sl
preferred label: bitki patenti @tr
preferred label: 品种专属权 @zh
preferred label: patente de plantas @es
preferred label: kasvinjalostepatentti @fi
preferred label: Pflanzenpatent @de
preferred label: patentirana sorta
definition: A patent granted to anyone who has invented or discovered and asexually reproduced any distinct and new variety of plant, including cultivated sports, mutants, hybrids, and newly found seedlings, other than a tuber-propagated plant or a plant found in an uncultivated state. [Source: Adapted from https://www.uspto.gov/patents/basics/types-patent-applications/general-information-about-35-usc-161#heading-1] @en
in scheme: Resource Types
preferred label: plant patent @en
type: Concept
preferred label: 植物特許 @ja
preferred label: patent de plantes @ca

чланак у часопису
alternative label: papier @fr
preferred label: articolo in rivista @it
preferred label: مقال في دورية @ar
related match: SubmittedJournalArticle
preferred label: 学術雑誌論文 @ja
preferred label: dergi makalesi @tr
alternative label: 期刊论文 @zh
alternative label: article scientifique @fr
preferred label: tieteellinen artikkeli @fi
preferred label: článek v odborném časopisu @cs
preferred label: article @fr
alternative label: рад у часопису
alternative label: 學術論文 @zh
narrower: научни чланак
narrower: erratum
preferred label: journal article @en
preferred label: журнальная статья @ru
alternative label: departmental bulletin paper @en
alternative label: artigo em revista @pt
related match: JournalItem
alternative label: paper @en
alternative label: rad u časopisu
alternative label: artigo científico @pt
definition: An article, typically the realization of a research paper reporting original research findings, published in a journal issue. [Source: http://purl.org/spar/fabio/JournalArticle] @en
alternative label: article revisat per parells @ca
alternative label: naučni članak
alternative label: articulo @es
preferred label: Wissenschaftlicher Artikel @de
alternative label: article de recherche @fr
alternative label: 記事 @ja
broad match: Article
alternative label: 論文 @zh
alternative label: artículo revisado por pares @es
alternative label: article científic @ca
preferred label: article de revista @ca
narrower: članak o skupu podataka
narrower: чланак о рачунарском програму
alternative label: 论文 @zh
alternative label: journal articles @en
alternative label: 紀要論文 @ja
preferred label: 学术论文 @zh
preferred label: artículo @es
alternative label: artículo científico @es
in scheme: Resource Types
alternative label: 文章 @zh
alternative label: artículo de revista @es
alternative label: articulo cientifico @es
broader: часопис
preferred label: wetenschappelijk artikel @nl
preferred label: članek v reviji @sl
alternative label: научни чланак
type: Concept
preferred label: artigo @pt
narrower: прегледни чланак
alternative label: articolo @it
alternative label: 期刊文章 @zh
preferred label: članak u časopisu
alternative label: 期刊論文 @zh

podaci iz kliničkih ispitivanja
preferred label: podatki kliničnih preskušanj @sl
alternative label: podaci iz kliničkih studija
preferred label: dades d'assajos clínics @ca
type: Concept
alternative label: klinično preskušanje @sl
preferred label: kliinisellä kokeella tuotettu data @fi
alternative label: подаци из клиничких студија
preferred label: clinical trial data @en
alternative label: dades d'estudis clínics @ca
preferred label: ensayo clínico @es
alternative label: essai thérapeutique @fr
editorial note: Published @en
preferred label: 臨床試験データ @ja
in scheme: Resource Types
preferred label: klinik deney verisi @tr
preferred label: данные клинических испытаний @ru
preferred label: klinische studie data @nl
alternative label: klinisch-wetenschappelijke data @nl
preferred label: donnée d'essai clinique @fr
alternative label: randomized control trial @en
preferred label: klinische Daten @de
broader: скуп података
preferred label: dados de ensaios clínicos @pt
preferred label: dati di trial clinico @it
preferred label: подаци из клиничких испитивања
preferred label: 临床试验数据 @zh
definition: Data resulting from a research study in which one or more human subjects are prospectively assigned to one or more interventions (which may include placebo or other control) to evaluate the effects of those interventions on health-related biomedical or behavioral outcomes. [Source: Adapted from https://grants.nih.gov/policy/clinical-trials/definition.htm] @en

capítulo de relatório
alternative label: partie de rapport @fr
alternative label: parte de un informe @es
preferred label: report part @en
preferred label: part d'un informe @ca
alternative label: parte de relatório @pt
preferred label: capitolo di rapporto tecnico @it
editorial note: Deprecated @en
preferred label: 報告書（部分） @ja
broad match: Report
preferred label: chapitre de rapport @fr
top concept of: Resource Types
alternative label: parte de una relacion @es
preferred label: 报告部分 @zh
preferred label: deelrapport @nl
definition: part of a report @en
preferred label: parte de un estudio @es
preferred label: Teilbericht @de
preferred label: rapor bölümü @tr
in scheme: Resource Types
alternative label: reportPart @en
expires: 2021-03-12
type: Concept
alternative label: 報告部分 @zh
alternative label: parte de una relación @es
alternative label: rapportdeel @nl

članak o skupu podataka
preferred label: data paper @it
preferred label: tutkimusaineistoa kuvaava artikkeli @fi
alternative label: Forschungsdatenartikel @de
preferred label: 数据文章 @zh
preferred label: ورقة بيانات @ar
alternative label: опис скупа података
alternative label: artículo de datos científicos @es
broader: чланак у часопису
preferred label: článek o datové sadě @cs
type: Concept
preferred label: データ論文 @ja
alternative label: article sur les données @fr
in scheme: Resource Types
preferred label: datadocumentatie @nl
preferred label: article de dades @ca
alternative label: data descriptor @en
preferred label: artigo de dados @pt
preferred label: чланак о скупу података
alternative label: articulo de datos @es
alternative label: opis podatkovne zbirke @sl
preferred label: artículo de datos @es
preferred label: статья с цифровыми данными @ru
preferred label: Data Paper @de
definition: A data paper is a scholarly publication describing a particular dataset or group of dataset, published in the form of a peer-reviewed article in a scholarly journal. The main purpose of a data paper is to describe data, the circumstances of their collection, and information related to data features, access and potential reuse. Adapted from https://en.wikipedia.org/wiki/Data_paper and http://www.gbif.org/publishing-data/data-papers @en
preferred label: članek o podatkovni zbirki @sl
alternative label: articulo de datos cientificos @es
alternative label: opis skupa podataka
alternative label: 數據文章 @zh

klinička studija
preferred label: étude clinique @fr
preferred label: clinical study @en
alternative label: 臨床研究 @ja
in scheme: Resource Types
alternative label: klinisch onderzoek @nl
definition: A work that reports on the results of a research study to evaluate interventions or exposures on biomedical or health-related outcomes. The two main types of clinical studies are interventional studies (clinical trials) and observational studies. While most clinical studies concern humans, this publication type may be used for clinical veterinary articles meeting the requisites for humans. [Source: https://www.ncbi.nlm.nih.gov/mesh/2009830] @en
preferred label: klinische studie @nl
preferred label: kliininen tutkimus @fi
type: Concept
preferred label: studio clinico @it
preferred label: клиничка студија
related match: ClinicalCaseReport
preferred label: klinische Studie @de
preferred label: estudi clínic @ca
preferred label: Klinik çalışması @tr
editorial note: Published @en
preferred label: клиническое исследование @ru
preferred label: klinična študija @sl
alternative label: essai clinique @fr
preferred label: estudio clínico @es
broader: извештај

анкетни подаци
alternative label: dades topogràfiques @ca
preferred label: Umfragedaten @de
preferred label: donnée d'enquête @fr
broader: скуп података
preferred label: 调查数据 @zh
preferred label: dati di indagine @it
preferred label: dades d'enquestes @ca
in scheme: Resource Types
preferred label: anketni podatki @sl
preferred label: anket verisi @tr
preferred label: 調査データ @ja
type: Concept
preferred label: haastatteluaineisto @fi
alternative label: onderzoeksgegevens @nl
preferred label: onderzoeksdata @nl
preferred label: datos de encuesta @es
preferred label: survey data @en
preferred label: anketni podaci
definition: Data resulting from a survey, which is defined as an investigation about the characteristics of a given population by means of collecting data from a sample of that population and estimating their characteristics through the systematic use of statistical methodology. Included are censuses, sample surveys, the collection of data from administrative records and derived statistical activities as well as questionnaires. [Source: Adapted from https://stats.oecd.org/glossary/detail.asp?ID=2620] @en
alternative label: survey-aineisto @fi
preferred label: данные опроса @ru
preferred label: dados de inquéritos @pt

експериментални подаци
preferred label: eksperimentalni podaci
preferred label: experimental data @en
preferred label: kokeellinen data @fi
preferred label: experimentelle Daten @de
preferred label: 実験データ @ja
preferred label: экспериментальные данные @ru
preferred label: donnée expérimentale @fr
preferred label: datos experimentales @es
broader: скуп података
preferred label: dati sperimentali @it
preferred label: 实验数据 @zh
preferred label: deneysel veri @tr
preferred label: dades experimentals @ca
preferred label: experimentele data @nl
in scheme: Resource Types
type: Concept
preferred label: dados experimentais @pt
definition: Data resulting from the experimental research method involving the manipulation of some or all of the independent variables included in the hypotheses. [Source: Adapted from https://ddialliance.org/Specification/DDI-CV/ModeOfCollection_3.0.html] @en
preferred label: eksperimentalni podatki @sl

poglavlje u knjizi
definition: A defined chapter or section of a book, usually with a separate title or number. [Source: http://purl.org/spar/fabio/BookChapter] @en
preferred label: část knihy @cs
alternative label: поглавље у монографији
alternative label: sestavek v knjigi @sl
alternative label: chapter @en
preferred label: capitolo di libro @it
preferred label: chapitre d'ouvrage @fr
alternative label: capítulo @pt
preferred label: capítol de llibre @ca
alternative label: parte de um livro @pt
in scheme: Resource Types
preferred label: kitap bölümü @tr
type: Concept
alternative label: kapitola v knize @cs
broad match: Book
alternative label: poglavlje u monografiji
preferred label: book part @en
preferred label: 章节 @zh
alternative label: parte de libro @es
alternative label: فصل من كتاب @ar
alternative label: part de llibre @ca
preferred label: جزء من كتاب @ar
alternative label: paragrafo @it
alternative label: 章節 @zh
alternative label: chapter in book @en
preferred label: 図書（部分） @ja
preferred label: boekdeel @nl
preferred label: kirjan osa @fi
preferred label: часть книги @ru
broader: књига
preferred label: poglavje v knjigi @sl
alternative label: partie d'ouvrage @fr
alternative label: Buchkapitel @de
alternative label: chapitre de livre @fr
preferred label: capítulo de livro @pt
preferred label: capítulo de libro @es
alternative label: book chapter @en
preferred label: Teil eines Buches @de
alternative label: capitulo de libro @es
preferred label: поглавље у књизи

tekst
preferred label: テキスト @ja
preferred label: текст
narrower: anotacija
narrower: текст на блогу
narrower: књига
narrower: писмо
narrower: предлог истраживачког пројекта
narrower: bibliografija
alternative label: 文檔 @zh
narrower: radni dokument
narrower: teza
narrower: новине
narrower: транскрипт
narrower: остале периодичне публикације
in scheme: Resource Types
narrower: извештај
preferred label: texto @pt
type: Concept
narrower: конференцијски прилог
alternative label: 文档 @zh
preferred label: 文本 @zh
preferred label: text @en
preferred label: metin @tr
preferred label: نص @ar
definition: A resource consisting primarily of words for reading. Examples include books, letters, dissertations, poems, newspapers, articles, archives of mailing lists. Note that facsimiles or images of texts are still of the genre Text. [Source: http://purl.org/dc/dcmitype/Text] @en
preferred label: texte @fr
narrower: prikaz
narrower: препринт
narrower: rukopis
narrower: информативна ревија
narrower: нотни запис
preferred label: teksti @fi
top concept of: Resource Types
preferred label: besedilo @sl
preferred label: Text @de
preferred label: testo @it
narrower: часопис
editorial note: Published @en
narrower: техничка документација
narrower: предавање

остало
preferred label: 其他 @zh
preferred label: altres @ca
preferred label: altro @it
in scheme: Resource Types
preferred label: ostalo
preferred label: ostatní @cs
type: Concept
preferred label: diğer @tr
preferred label: other @en
preferred label: otros @es
preferred label: outros @pt
preferred label: sonstige @de
preferred label: その他 @ja
preferred label: другое @ru
preferred label: autre @fr
preferred label: آخر @ar
definition: A resource type that is not included in existing terms. [COAR definition] @en
alternative label: 其它 @zh
preferred label: muu @fi
preferred label: anders @nl
top concept of: Resource Types

期刊文献
alternative label: articolo in rivista @it
top concept of: Resource Types
type: Concept
alternative label: articulo de revista @es
preferred label: contribució a revista @ca
preferred label: tijdschrift bijdrage @nl
definition: A contribution to a journal denotes a work published in a journal. If applicable sub-terms should be chosen. @en
preferred label: contribution à un journal @fr
preferred label: Zeitschriftenbeitrag @de
preferred label: 学術雑誌掲載記事 @ja
preferred label: příspěvek v časopisu @cs
alternative label: artículo de boletín @es
preferred label: مساهمة في دورية @ar
alternative label: artículo de prensa @es
alternative label: articulo de prensa @es
preferred label: contribución a revista @es
alternative label: 期刊论文 @zh
alternative label: artículo de revista @es
preferred label: prispevek v reviji @sl
alternative label: مقال في دورية @ar
preferred label: contributo in rivista @it
preferred label: contributo em revista @pt
alternative label: 期刊文獻 @zh
in scheme: Resource Types
expires: 2021-03-12
preferred label: contribution to journal @en

bibliografija
type: Concept
alternative label: 書目 @zh
preferred label: bibliographie @fr
preferred label: библиография @ru
preferred label: بيبليوغرافيا @ar
preferred label: bibliography @en
preferred label: bibliografie @nl
preferred label: 文献目录 @zh
preferred label: bibliografia @fi
definition: A list of the books and articles that have been used by someone when writing a particular book or article [Source: https://dictionary.cambridge.org/dictionary/english/bibliography] @en
alternative label: 书目 @zh
alternative label: přehled literatury @cs
alternative label: 文獻目錄 @zh
preferred label: bibliografía @es
broader: tekst
preferred label: Bibliografie @de
alternative label: bibliyografya @tr
in scheme: Resource Types
preferred label: 書誌 @ja
preferred label: библиографија
broad match: Text
alternative label: لائحة مراجع @ar
preferred label: kaynakça @tr

протокол истраживања
preferred label: 研究プロトコル @ja
preferred label: протокол исследования @ru
alternative label: raziskovalni protokol @sl
preferred label: 研究方案 @zh
preferred label: tutkimussuunnitelma @fi
alternative label: metodologia de recerca @ca
broader: извештај
preferred label: protocole de recherche @fr
preferred label: research protocol @en
definition: The protocol is a detailed plan of the research study including a project summary, project description covering the rationale, objectives, methodology, data management and analysis, ethical considerations, gender issues and references. [Source: Adapted from https://www.who.int/publications/i/item/a-practical-guide-for-health-researchers] @en
preferred label: protocol de recerca @ca
preferred label: protocolo de investigación @es
preferred label: protokol istraživanja
alternative label: metodología de investigación @es
preferred label: protokol raziskave @sl
in scheme: Resource Types
preferred label: protocollo di ricerca @it
preferred label: araştırma protokolü @tr
type: Concept
preferred label: onderzoeksprotocol @nl

остале периодичне публикације
preferred label: ostale serijske publikacije @sl
alternative label: ostala periodika
alternative label: остала периодика
preferred label: muu kausijulkaisu @fi
preferred label: other periodical @en
alternative label: anders @nl
definition: A resource type that is not included in existing terms under the top concept "Text". [COAR definition] @en
preferred label: 其他连续出版物 @zh
preferred label: periodieke uitgave @nl
preferred label: autre périodique @fr
in scheme: Resource Types
preferred label: その他の逐次刊行物 @ja
alternative label: altre publicació en sèrie @ca
type: Concept
preferred label: diğer süreli yayınlar @tr
preferred label: другое периодическое издание @ru
preferred label: altro periodico @it
preferred label: ostale periodične publikacije
broader: tekst
preferred label: altre publicació periòdica @ca
preferred label: otras publicaciones periódicas @es

veb-sajt
in scheme: Resource Types
alternative label: webové stránky @cs
preferred label: вебсайт @ru
preferred label: website @en
preferred label: spletna stran @sl
alternative label: portal web @es
alternative label: 讨论会 @zh
alternative label: internet prezentacija
alternative label: página web @pt
preferred label: sito web @it
preferred label: webové sídlo @cs
broader: interaktivna građa
preferred label: 网站 @zh
alternative label: pagine web @it
alternative label: веб-страница
alternative label: 網站 @zh
alternative label: интернет презентација
preferred label: verkkosivusto @fi
type: Concept
alternative label: صفحة الويب @ar
preferred label: Webseite @de
alternative label: pagina web @es
preferred label: web sitesi @tr
alternative label: webpage @en
alternative label: pàgina web @ca
preferred label: ウェブサイト @ja
definition: A collection of related web pages containing text, images, videos and/or other digital assets that are addressed relative to a common Uniform Resource Locator (URL). A web site is hosted on at least one web server, accessible via a network such as the Internet or a private local area network. [Source: http://purl.org/spar/fabio/WebSite] @en
preferred label: sitio web @es
alternative label: portail web @fr
alternative label: sítio na internet @pt
alternative label: portal @es
alternative label: páginas web @es
preferred label: lloc web @ca
alternative label: sitios web @es
preferred label: site web @fr
preferred label: موقع الكتروني @ar
alternative label: paginas web @es
alternative label: veb-stranica
editorial note: Published @en
alternative label: web-sivusto @fi
preferred label: веб-сајт
preferred label: sítio web @pt
alternative label: servidor web @es

скуп података
preferred label: 数据集 @zh
alternative label: data sets @en
in scheme: Resource Types
narrower: podaci iz kliničkih ispitivanja
alternative label: tutkimusdata @fi
preferred label: dataset @it
definition: A collection of related facts and data encoded in a defined structure. [Source: Adapted from http://purl.org/spar/fabio/Dataset] @en
alternative label: grup de dades @ca
narrower: kodirani podaci
narrower: snimljeni podaci
alternative label: 數據集 @zh
alternative label: 資料組 @zh
preferred label: conjunto de datos @es
narrower: геномски подаци
preferred label: podatkovna zbirka @sl
alternative label: base de dados @pt
preferred label: набор данных @ru
preferred label: مجموعة بيانات @ar
alternative label: zbirka podatkov @sl
narrower: подаци мерења и испитивања
narrower: laboratorijske beleške
preferred label: veri seti @tr
narrower: симулациони подаци
alternative label: base de datos @es
preferred label: Datensatz @de
alternative label: grupo de datos @es
alternative label: سلسلة بيانات @ar
preferred label: tutkimusaineisto @fi
type: Concept
narrower: агрегирани подаци
narrower: kompilacija podataka
alternative label: série de données @fr
alternative label: dades de recerca @ca
preferred label: datová sada @cs
narrower: анкетни подаци
related match: cod
narrower: геопросторни подаци
alternative label: 资料组 @zh
preferred label: conjunto de dados @pt
preferred label: skup podataka
narrower: подаци прикупљени посматрањем
preferred label: jeu de données @fr
narrower: експериментални подаци
preferred label: conjunt de dades @ca
preferred label: データセット @ja
top concept of: Resource Types

мапа
alternative label: чертёж @ru
broader: kartografska građa
preferred label: kartta @fi
preferred label: mapa
in scheme: Resource Types
preferred label: mappa @it
definition: Defined as a representation normally to scale and on a flat medium, of a selection of material or abstract features on, or in relation to, the surface of the earth or of another celestial body. [Source: https://www.loc.gov/marc/bibliographic/bd007a.html] @en
definition: harita @tr
preferred label: Karte @de
type: Concept
preferred label: 地图 @zh
preferred label: map @en
alternative label: geografska karta
alternative label: географска карта
preferred label: zemljevid @sl
preferred label: carte géographique @fr
alternative label: план @ru
alternative label: carte @fr
preferred label: карта @ru
editorial note: Published @en
alternative label: plan @fr
alternative label: отображение @ru
preferred label: kaart @nl
alternative label: 地圖 @zh
preferred label: 地図 @ja
preferred label: harita @tr
preferred label: خارطة @ar

anotacija
preferred label: annotation @en
related match: LegalOpinion
alternative label: zaznamba @sl
alternative label: komentar
alternative label: glosa @es
alternative label: 標注 @zh
preferred label: Urteilsanmerkung @de
alternative label: nota a un texto de jurisprudencia @es
preferred label: commento @it
definition: An annotation in the sense of a legal note is a legally explanatory comment on a decision handed down by a court or arbitral tribunal. [Source: DRIVER info:eu-repo definition] @en
alternative label: 註釋 @zh
preferred label: právní komentář rozsudku nebo rozhodnutí @cs
alternative label: реферат @ru
alternative label: коментар
preferred label: شرح @ar
preferred label: zaznamek @sl
alternative label: 詮釋 @zh
alternative label: comentário @pt
alternative label: 注释 @zh
preferred label: 注釈 @ja
alternative label: nota @pt
alternative label: 诠释 @zh
alternative label: белешка
broader: tekst
alternative label: beleška
alternative label: opomba @sl
alternative label: anotación @es
alternative label: annotazione @it
preferred label: anotació @ca
alternative label: note to a legal judgment @en
preferred label: nota de jurisprudencia @es
preferred label: açıklama @tr
in scheme: Resource Types
alternative label: pravno mnenje @sl
preferred label: anotação @pt
alternative label: glossa @ca
alternative label: comentario @es
preferred label: annotatie @nl
preferred label: аннотация @ru
type: Concept
preferred label: анотација
broad match: Text
alternative label: apontamento @pt
alternative label: Entscheidungsanmerkung @de
preferred label: 标注 @zh
preferred label: kommentaari @fi
alternative label: dipnot @tr

teza
preferred label: tese @pt
narrow match: BachelorsThesis
preferred label: kvalifikační práce @cs
narrower: мастер/магистарска теза
preferred label: thèse @fr
preferred label: scriptie @nl
preferred label: tesis @es
alternative label: disertacija
alternative label: mémoire de thèse @fr
preferred label: tesi @it
alternative label: 毕业论文 @zh
preferred label: теза
alternative label: 學位論文 @zh
preferred label: 学位論文 @ja
preferred label: диссертация @ru
narrower: дипломски рад
alternative label: 畢業論文 @zh
narrower: doktorska disertacija
preferred label: رسالة @ar
alternative label: rapport de thèse @fr
preferred label: schriftliche Abschlussarbeit @de
broader: tekst
preferred label: 学位论文 @zh
preferred label: tez @tr
preferred label: opinnäyte @fi
preferred label: thesis @en
preferred label: zaključno delo študija @sl
in scheme: Resource Types
alternative label: дисертација
type: Concept
definition: A book authored by a student containing a formal presentations of research outputs submitted for examination in completion of a course of study at an institution of higher education, to fulfil the requirements for an academic degree. Also know as a dissertation. [Source: http://purl.org/spar/fabio/Thesis] @en
broad match: Text

saopštenje sa konferencije
preferred label: 会议论文 @zh
preferred label: comunicação em conferência @pt
alternative label: рад са конференције
preferred label: příspěvek na konferenci @cs
alternative label: presentacion de congreso @es
alternative label: 會議文章 @zh
definition: A paper, published within a conference proceeding, typically the realization of a research paper reporting original research findings. [Source: Adapted from http://purl.org/spar/fabio/ConferencePaper] @en
alternative label: apresentação em congresso @pt
alternative label: prispevek na konferenci @sl
alternative label: 会议文章 @zh
type: Concept
preferred label: саопштење са конференције
preferred label: ورقة مؤتمر @ar
alternative label: conferencePaper @en
preferred label: conference paper @en
alternative label: artigo de congresso @pt
alternative label: rad sa konferencije
alternative label: објављено саопштење са конференције
alternative label: comunicação @pt
alternative label: documento presentado en un congreso @es
alternative label: comunicación de conferencia @es
alternative label: článek ve sborníku konference @cs
broad match: Event
alternative label: objavljeno saopštenje sa konferencije
alternative label: trabajo presentado en un congreso @es
alternative label: apresentação em conferência @pt
preferred label: comunicació de congrés @ca
alternative label: article de conférence @fr
alternative label: presentació de congrés @ca
preferred label: comunicación de congreso @es
preferred label: конференционный доклад @ru
preferred label: article dans une conférence @fr
alternative label: comunicação em congresso @pt
preferred label: konferans belgesi @tr
alternative label: comunicacion de conferencia @es
broader: zbornik saopštenja sa konferencije
alternative label: comunicacion de congreso @es
preferred label: članek na konfrenci @sl
alternative label: trabajo presentado en una conferencia @es
alternative label: documento presentado en una conferencia @es
alternative label: članek na konferenci @sl
preferred label: comunicazione a congresso @it
in scheme: Resource Types
alternative label: اوراق المؤتمر @ar
preferred label: artikkeli konferenssijulkaisussa @fi
alternative label: article de congrès @fr
preferred label: conferentie paper @nl
preferred label: Konferenzbeitrag @de
alternative label: presentación de congreso @es
alternative label: 會議論文 @zh
preferred label: 会議発表論文 @ja
alternative label: artigo de conferência @pt

prezentacija sa konferencije
alternative label: presentació de conferència @ca
preferred label: Konferenzpräsentation @de
preferred label: 会議発表資料 @ja
type: Concept
preferred label: presentación de congreso @es
definition: A set of slides containing text, tables or figures, designed to communicate ideas or research results, for projection and viewing by an audience at a conference, symposium, seminar, lecture, workshop or other gatherings. [Source: Adapted from http://purl.org/spar/fabio/Presentation] @en
preferred label: conference presentation @en
alternative label: presentación @es
preferred label: support de présentation à une conférence @fr
preferred label: 会议演示报告 @zh
preferred label: presentazione a convegno @it
preferred label: conferentie presentatie @nl
broader: конференцијски прилог
preferred label: presentació a congrés @ca
preferred label: konferans sunumu @tr
preferred label: презентација са конференције
alternative label: presentació de comunicació @ca
preferred label: predstavitev na konferenci @sl
preferred label: конференционная презентация @ru
in scheme: Resource Types
preferred label: konferenssiesitelmä @fi

извештај о истраживању
preferred label: Forschungsbericht @de
alternative label: 科研報告 @zh
alternative label: 調研報告 @zh
preferred label: 研究报告 @zh
alternative label: informe científic @ca
alternative label: 调研报告 @zh
alternative label: reporte cientifico @es
preferred label: relatório de investigação @pt
preferred label: исследовательский отчет @ru
preferred label: informe de recerca @ca
type: Concept
alternative label: informe del resultado de una investigación @es
alternative label: rapport scientifique @fr
alternative label: memoria científica @es
alternative label: 研究報告 @zh
preferred label: 研究報告書 @ja
preferred label: izveštaj o istraživanju
alternative label: reporte científico @es
preferred label: informe científico @es
alternative label: informe de investigacion @es
preferred label: rapporto di ricerca @it
alternative label: informe de investigación @es
alternative label: reporte de investigación @es
alternative label: memòria científica @ca
preferred label: research report @en
preferred label: poročilo o rezultatih raziskav @sl
preferred label: tutkimusraportti @fi
definition: It is publication that reports on the findings of a research project or alternatively scientific observations on or about a subject. [Source: Adapted from https://en.wikipedia.org/wiki/Research_report] @en
editorial note: Published @en
preferred label: onderzoeksrapport @nl
in scheme: Resource Types
preferred label: araştırma raporu @tr
preferred label: rapport de recherche @fr
alternative label: informe cientifico @es
preferred label: výzkumná zpráva @cs
alternative label: 科研报告 @zh
broader: извештај
alternative label: تقرير بحث @ar
alternative label: تقرير علمي @ar

текст на блогу
preferred label: prispevek na blogu @sl
preferred label: article de blog @fr
definition: A piece of writing or other item of content published on a blog. [Source: https://www.lexico.com/definition/blog_post] @en
alternative label: post de blog @fr
preferred label: ブログ記事 @ja
alternative label: пост в блоге @ru
alternative label: apunt de blog @ca
editorial note: Published @en
broader: tekst
alternative label: billet de blog @fr
in scheme: Resource Types
preferred label: articolo di blog @it
preferred label: Blogbeitrag @de
preferred label: пост @ru
preferred label: blog post @nl
preferred label: Blog yazısı @tr
alternative label: missatge de blog @ca
broad match: WebContent
preferred label: entrada de blog @es
broad match: Blog
preferred label: tekst na blogu
preferred label: blogiteksti @fi
type: Concept
alternative label: notícia de blog @ca

књига
broad match: Text
preferred label: 図書 @ja
preferred label: llibre @ca
preferred label: monografija
broader: tekst
preferred label: boek @nl
alternative label: livre @fr
alternative label: obra monográfica @es
preferred label: book @en
preferred label: 书 @zh
alternative label: books @en
alternative label: monograph @en
alternative label: monografia @ca
type: Concept
preferred label: كتاب @ar
preferred label: kniha @cs
preferred label: Buch @de
preferred label: libro @es
alternative label: monografie @cs
preferred label: kitap @tr
preferred label: knjiga
preferred label: livro @pt
in scheme: Resource Types
related match: Book
narrow match: BookReview
definition: A non-serial publication that is complete in one volume or a designated finite number of volumes. [Source: Adapted from http://purl.org/eprint/type/Book] @en
alternative label: 書 @zh
alternative label: монографија
preferred label: ouvrage @fr
narrower: poglavlje u knjizi
alternative label: monographie @fr
alternative label: افرودة @ar
alternative label: 专著 @zh
preferred label: книга @ru
alternative label: obra monografica @es
alternative label: 图书 @zh
alternative label: 專著 @zh
alternative label: e-book @en
alternative label: Monographie @de
alternative label: monografía @es
alternative label: audiobook @en
alternative label: 圖書 @zh
preferred label: kirja @fi

друге врсте извештаја
expires: 2021-03-12
alternative label: outro tipo de relatório @pt
alternative label: guideline @en
definition: Other types of report may include Business Plans Technical Specifications, data management plans, recommendation reports, white papers, annual reports, auditor's reports, workplace reports, census reports, trip reports, progress reports, investigative reports, budget reports, policy reports, demographic reports, credit reports, appraisal reports, inspection reports, military reports, bound reports, etc. [Source: https://en.wikipedia.org/wiki/Report] @en
top concept of: Resource Types
in scheme: Resource Types
preferred label: その他の報告書 @ja
preferred label: druge vrste izveštaja
preferred label: نوع آخر من التقرير @ar
preferred label: sonstiger Report @de
alternative label: 其它報告 @zh
preferred label: 其他报告 @zh
preferred label: ostale vrste poročil @sl
preferred label: rapport overig @nl
preferred label: diğer rapor türü @tr
preferred label: altro tipo di rapporto @it
alternative label: otro tipo de reporte @es
alternative label: ander type rapport @nl
preferred label: autre type de rapport @fr
type: Concept
alternative label: laboratory material @en
editorial note: Deprecated @en
preferred label: jiná zpráva @cs
preferred label: other type of report @en
preferred label: outro relatório @pt
preferred label: otro tipo de informe @es
preferred label: altre tipus d'informe @ca

нотни запис
alternative label: partition musicale @fr
preferred label: 楽譜 @ja
alternative label: Notenschrift @de
alternative label: partition de musique @fr
preferred label: تدوينة موسيقية @ar
alternative label: partitura @es
preferred label: hudební zápis @cs
alternative label: notacion musical @es
alternative label: مدونة موسيقية @ar
in scheme: Resource Types
preferred label: Musiknotation @de
preferred label: nota @tr
preferred label: partition @fr
type: Concept
preferred label: nuottikirjoitus @fi
broader: tekst
preferred label: notación musical @es
alternative label: noty @cs
alternative label: music notation @en
alternative label: notenschrift @nl
alternative label: 樂譜 @zh
preferred label: muzieknotatie @nl
preferred label: нотная запись @ru
preferred label: notni zapis
preferred label: 乐谱 @zh
preferred label: musical notation @en
editorial note: Published @en
preferred label: notazione musicale @it
preferred label: notació musical @ca
definition: Symbols used to write music, as in a music score, and to express mathematical concepts. [Source: Adapted from https://products.abc-clio.com/ODLIS/odlis_n.aspx] @en
preferred label: note @sl
preferred label: notação musical @pt

erratum
definition: A formal correction to an error introduced by the author into a previously published document. (adapted from https://sparontologies.github.io/fabio/current/fabio.html#d4e2712) @en
preferred label: corrigendum
preferred label: corrigenda @es
alternative label: fe d'errates @ca
preferred label: исправление @ru
alternative label: ispravka
editorial note: Published @en
alternative label: errata @fi
in scheme: Resource Types
alternative label: Berichtigung @de
preferred label: 正誤表 @ja
broader: чланак у часопису
broad match: Correction
preferred label: Korrigendum @de
alternative label: correcció @ca
related match: Erratum
type: Concept
alternative label: fe de erratas @es
preferred label: popravek članka @sl
preferred label: correcció d’errors @ca
alternative label: исправка

zvučni zapis
preferred label: som @pt
alternative label: geluid @nl
preferred label: Ton @de
preferred label: ses @tr
broad match: MediaObject
preferred label: звук @ru
preferred label: sound @en
in scheme: Resource Types
preferred label: so @ca
alternative label: zvok @sl
preferred label: zvočni zapis @sl
preferred label: suono @it
preferred label: ääni @fi
type: Concept
preferred label: صوت @ar
definition: A resource primarily intended to be heard. Examples include a music playback file format, an audio compact disc, and recorded speech or sounds. [Source: http://dublincore.org/documents/dcmi-terms/#dcmitype-Sound] @en
narrower: muzička kompozicija
preferred label: 音声・音楽 @ja
alternative label: 聲音 @zh
top concept of: Resource Types
preferred label: звучни запис
alternative label: تسجيل صوتي @ar
preferred label: son @fr
preferred label: sonido @es
preferred label: zvuk @cs
editorial note: Published @en
preferred label: 声音 @zh
alternative label: enregistrement sonore @fr
alternative label: document sonore @fr

патентна пријава
preferred label: Заявка РСТ @ru
preferred label: PCT başvurusu @tr
alternative label: aplicació del PCT @ca
preferred label: patentna prijava
preferred label: domanda internazionale di brevetto @it
preferred label: PCT @ca
preferred label: PCT application @en
type: Concept
preferred label: kansainvälinen patenttihakemus @fi
preferred label: PCT出願 @ja
definition: A patent application filed through the WIPO-administered Patent Cooperation Treaty (PCT), also known as an international application. [Source: Adapted from https://www.wipo.int/edocs/pubdocs/en/wipo_pub_943_2018.pdf] @en
in scheme: Resource Types
preferred label: PCT-aanvraag @nl
broader: patent
preferred label: 国际专利合作条约PCT申请 @zh
alternative label: Patent İşbirliği Anlaşması başvurusu @tr
alternative label: tractat de cooperació en materia de patents @ca
preferred label: demande PCT @fr
preferred label: Internationale Patentanmeldung @de

наставни материјал
preferred label: Lernobjekt @de
preferred label: object d'apprentissage @fr
in scheme: Resource Types
preferred label: leerobject @nl
editorial note: Published @en
preferred label: objecte d’aprenentatge @ca
alternative label: Kursmaterial @de
type: Concept
preferred label: learning object @en
preferred label: učno gradivo @sl
alternative label: odprti učni vir @sl
preferred label: materiale didattico @it
definition: A digital resource that can be reused to enhance teaching and learning. [Source: https://icas-ca.org/archive/projects/coerc/oer-glossary] @en
preferred label: objeto de aprendizaje @es
preferred label: oppimateriaali @fi
alternative label: open education resource @en
preferred label: учебный объект @ru
preferred label: 教材 @ja
alternative label: coursepack @en
preferred label: Öğrenim nesnesi @tr
preferred label: nastavni materijal
top concept of: Resource Types
alternative label: Lernunterlagen @de

конференцијски прилог
narrower: zbornik saopštenja sa konferencije
preferred label: contribució a congrés @ca
preferred label: contribución de congreso @es
broader: tekst
preferred label: documento de conferência @pt
type: Concept
preferred label: Konferenzveröffentlichung @de
preferred label: 会議資料 @ja
narrower: prezentacija sa konferencije
preferred label: конференц-объект @ru
narrower: необјављен постер са конференције
broad match: Event
preferred label: risultato di convegno @it
narrower: необјављено саопштење са конференције
preferred label: 会议对象 @zh
preferred label: rezultat na konferenci @sl
preferred label: objet présenté à une conférence @fr
preferred label: conference output @en
preferred label: conferentie bijdrage @nl
definition: All kind of digital resources contributed to a conference, like conference presentation (slides), conference report, conference lecture, abstracts, demonstrations. For conference papers, posters or proceedings the specific sub-concepts should be used. [COAR definition] @en
preferred label: konferencijski prilog
in scheme: Resource Types
preferred label: konferans çıktısı @tr

писмо
preferred label: pismo
alternative label: lettera @it
definition: A brief description of important new research, also known as “communication”. [Source: https://cerif.eurocris.org/vocab/html/OutputTypes.html#Letter] @en
in scheme: Resource Types
alternative label: dikusijski prispevek @sl
preferred label: lettre @fr
broad match: Text
preferred label: Brief @de
broader: tekst
preferred label: carta @ca
preferred label: dopis @cs
alternative label: Leserbrief @de
preferred label: brief @nl
type: Concept
alternative label: missiva @pt
preferred label: letter @en
preferred label: письмо @ru
preferred label: 信 @zh
alternative label: 读者来信 @zh
preferred label: mektup @tr
preferred label: kirje @fi
alternative label: Korrespondenz @de
preferred label: 短報 @ja
alternative label: 讀者來信 @zh
preferred label: مراسلة @ar
preferred label: comunicazione @it
alternative label: polemika @sl

заштићена биљна сорта
alternative label: COB @fr
in scheme: Resource Types
alternative label: obtenció de les varietats vegetals @ca
preferred label: privativa di varietà vegetale @it
preferred label: plantenras bescherming @nl
preferred label: bitki çeşitliliğini koruma @tr
preferred label: zaštićena biljna sorta
preferred label: охрана новых сортов растений @ru
type: Concept
preferred label: plant variety protection @en
preferred label: certificat d'obtention végétale @fr
preferred label: 育成者権 @ja
preferred label: protecció de les varietats vegetals @ca
definition: Plant variety protection, also called a "plant breeder's right" (PBR), is a form of intellectual property right granted to the breeder of a new plant variety . According to this right, certain acts concerning the exploitation of the protected variety require the prior authorization of the breeder. Plant variety protection is an independent sui generis form of protection, tailored to protect new plant varieties and has certain features in common with other intellectual property rights. [Source: https://www.wipo.int/edocs/pubdocs/en/wipo_pub_943_2018.pdf] @en
broader: patent
preferred label: kasvinjalostajanoikeus @fi
preferred label: žlahniteljska pravica @sl
preferred label: Sortenschutz @de
preferred label: obtención de variedades vegetales @es
preferred label: 植物新品种保护 @zh

дипломски рад
alternative label: tesis de bachiller @es
preferred label: proyecto fin de carrera @es
in scheme: Resource Types
alternative label: trabajo de fin de carrera @es
preferred label: 学士学位论文 @zh
preferred label: رسالة بكالوريوس @ar
preferred label: бакалаврская диссертация @ru
preferred label: treball de fi de grau @ca
preferred label: 学士論文 @ja
broader: teza
alternative label: monografia de licenciatura @pt
preferred label: mémoire de stage @fr
preferred label: bachelor thesis @en
preferred label: bakalářská práce @cs
definition: A thesis reporting a research project undertaken as part of an undergraduate course of education leading to a bachelor's degree. [Source: http://purl.org/spar/fabio/BachelorsThesis] @en
alternative label: projecte final de carrera @ca
preferred label: tesi di laurea @it
alternative label: rapport de stage @fr
alternative label: diplomska naloga @sl
broad match: Thesis
alternative label: trabalho de fim de licenciatura @pt
preferred label: bachelorscriptie @nl
alternative label: 本科毕业论文 @zh
alternative label: tesis de licenciatura @es
preferred label: diplomsko delo @sl
preferred label: diplomski rad
preferred label: kandidaatin tutkielma @fi
alternative label: 本科畢業論文 @zh
preferred label: trabalho de fim de curso @pt
alternative label: tesina @es
alternative label: monografia de fim de curso @pt
preferred label: lisans tezi @tr
alternative label: bachelor dissertation @en
type: Concept
alternative label: trabajo final de grado @es
alternative label: 學士學位論文 @zh
preferred label: Abschlussarbeit (Bachelor) @de

часопис
alternative label: revista académica @es
type: Concept
alternative label: odborný časopis @cs
preferred label: znanstvena revija @sl
preferred label: rivista @it
alternative label: 学报 @zh
preferred label: revista científica @ca
alternative label: دورية علمية @ar
preferred label: журнал @ru
alternative label: 科学期刊 @zh
alternative label: périodique @fr
preferred label: revista @es
preferred label: Zeitschrift @de
alternative label: مجلة علمية @ar
alternative label: periódico @pt
preferred label: odborné periodikum @cs
narrower: писмо уреднику
narrow match: JournalArticle
narrower: чланак у часопису
preferred label: wetenschappelijk tijdschrift @nl
alternative label: 科學期刊 @zh
alternative label: pubblicazione periodica @it
preferred label: dergi @tr
alternative label: 學報 @zh
preferred label: 学術雑誌 @ja
alternative label: 學術期刊 @zh
preferred label: 学术期刊 @zh
in scheme: Resource Types
alternative label: научни часопис
preferred label: journal @en
alternative label: naučni časopis
narrower: уводник
broad match: Text
preferred label: revue @fr
preferred label: tieteellinen kausijulkaisu @fi
broader: tekst
alternative label: revue scientifique @fr
preferred label: časopis
definition: A journal is a serial publication devoted to disseminating original research and current developments on a subject. (Adapted from ODLIS) [Source: http://dspacecris.eurocris.org/cris/classcerif/classcerif00422] @en
preferred label: دورية @ar

мастер/магистарска теза
in scheme: Resource Types
alternative label: master/magistarski rad
preferred label: dissertação de mestrado @pt
alternative label: tesina @es
preferred label: tesis de maestría @es
preferred label: магистерская диссертация @ru
preferred label: maisterintutkielma @fi
alternative label: trabajo final de posgrado @es
alternative label: tese de mestrado @pt
definition: A thesis reporting a research project undertaken as part of a graduate course of education leading to a master's degree. [Source: http://purl.org/spar/fabio/MastersThesis] @en
preferred label: رسالة ماجستير @ar
type: Concept
preferred label: yüksek lisans tezi @tr
preferred label: treball final de màster @ca
alternative label: rapport de maîtrise @fr
alternative label: treball de fi de postgrau @ca
broad match: Thesis
alternative label: 碩士學位論文 @zh
alternative label: trabajo final de máster @es
alternative label: tesis de maestria @es
alternative label: trabajo final de master @es
preferred label: 修士論文 @ja
preferred label: master thesis @en
broader: teza
preferred label: masterscriptie @nl
alternative label: 碩士研究生畢業論文 @zh
preferred label: Abschlussarbeit (Master) @de
alternative label: mémoire de maîtrise @fr
preferred label: tesi di master @it
preferred label: master/magistarska teza
alternative label: 硕士研究生毕业论文 @zh
preferred label: 硕士学位论文 @zh
alternative label: rapport de master @fr
alternative label: magistrska naloga @sl
preferred label: mémoire de master @fr
alternative label: trabajo final de maestría @es
alternative label: master dissertation @en
preferred label: magistrsko delo @sl
preferred label: diplomová práce @cs
alternative label: мастер/магистарски рад

уводник
alternative label: editorial de revista @es
alternative label: реч уредника
preferred label: editorial @en
alternative label: presentació @ca
alternative label: Leitartikel @de
preferred label: uvodnik
alternative label: tribuna de opinión @es
preferred label: エディトリアル @ja
preferred label: Vorwort @de
alternative label: 社評 @zh
preferred label: Editoryal @tr
alternative label: édito @fr
preferred label: pääkirjoitus @fi
preferred label: افتتاحية @ar
alternative label: 社评 @zh
preferred label: voorwoord @nl
preferred label: редакционная @ru
in scheme: Resource Types
alternative label: artículo de fondo @es
preferred label: éditorial @fr
preferred label: úvodník @cs
alternative label: reč urednika
type: Concept
preferred label: editoriale @it
definition: A brief essay expressing the opinion or position of the chief editor(s) of a (academic) journal with respect to a current political, social, cultural, or professional issue. [Source: Adapted from ODLIS [Source: http://www.abc-clio.com/ODLIS/odlis_e.aspx ] @en
preferred label: 社论 @zh
broader: часопис
alternative label: 社論 @zh

новине
preferred label: journal @fr
preferred label: krant @nl
preferred label: sanomalehti @fi
preferred label: 新聞 @ja
preferred label: giornale @it
preferred label: newspaper @en
editorial note: Published @en
broader: tekst
alternative label: diario @es
preferred label: periódico @es
in scheme: Resource Types
alternative label: časnik @sl
definition: A non-peer reviewed periodical, usually published daily or weekly, consisting primarily of editorials and news items concerning current or recent events and matters of public interest. [Source: http://purl.org/spar/fabio/Newspaper] @en
type: Concept
preferred label: diari @ca
preferred label: Gazete @tr
preferred label: Zeitung @de
preferred label: газета @ru
preferred label: novine
narrower: новински чланак
preferred label: časopis @sl

предлог истраживачког пројекта
preferred label: Exposé @de
in scheme: Resource Types
preferred label: proposta di progetto @it
preferred label: tutkimusehdotus @fi
alternative label: مقترح بحث @ar
type: Concept
preferred label: onderzoeksvoorstel @nl
preferred label: propuesta de recerca @ca
preferred label: 研究計画書 @ja
alternative label: 研究方案 @zh
preferred label: proposta de investigação @pt
preferred label: araştırma önerisi @tr
alternative label: propuesta de investigacion @es
preferred label: 研究计划 @zh
preferred label: projet de recherche @fr
preferred label: návrh výzkumného projektu @cs
preferred label: исследовательское предложение @ru
preferred label: predlog istraživačkog projekta
alternative label: 研究計劃 @zh
preferred label: predlog raziskave @sl
alternative label: researchProposal @en
alternative label: proposta de projeto @pt
definition: A research proposal is a document proposing a research project, generally in the sciences or academia, and generally constitutes a request for sponsorship of that research. [Source: https://en.wikipedia.org/wiki/Research_proposal] @en
alternative label: proposta di ricerca @it
alternative label: propuesta de proyecto @es
preferred label: research proposal @en
alternative label: propuesta d'investigació @ca
broader: tekst
preferred label: اقتراح بحث @ar
preferred label: propuesta de investigación @es
broad match: Text
alternative label: raziskovalna prijava @sl
alternative label: propuesta de projecte @ca
alternative label: réponse à appel à projet @fr

intervju
in scheme: Resource Types
type: Concept
alternative label: Mülakat @tr
preferred label: entrevista @ca
alternative label: Röportaj @tr
preferred label: Görüşme @tr
narrow match: Broadcast Interview
expires: 2021-03-12
top concept of: Resource Types
narrow match: interview
preferred label: Interview @de
preferred label: interview @nl
alternative label: interviu @ca
narrow match: Text Interview
definition: A discussion between a reporter, host, panel, or audience and a newsmaker, author, or celebrity, recorded (edited or unedited) in print, on film or video, as transcript or as a sound recording. (Adapted from ODLIS) @en
editorial note: Published @en
preferred label: intervista @it
preferred label: インタビュー @ja

прегледни чланак
alternative label: 综述论文 @zh
preferred label: přehledový článek @cs
alternative label: artículo de reseña @es
preferred label: Übersichtsartikel @de
alternative label: recensie-artikel @nl
definition: A review article is a secondary source, that is, it is written about other articles, and does not report original research of its own. [Source: Adapted from http://apus.libanswers.com/faq/2324] @en
preferred label: katsausartikkeli @fi
alternative label: article de revisió @ca
editorial note: Published @en
broader: чланак у часопису
preferred label: обзорная статья @ru
alternative label: прегледни рад
alternative label: pregledni naučni članak
alternative label: 综述 @zh
in scheme: Resource Types
preferred label: overzichtsartikel @nl
preferred label: pregledni znanstveni članek @sl
alternative label: pregledni rad
preferred label: review article @en
alternative label: articulo de reseña @es
alternative label: articulo de revision @es
alternative label: 综述评论性论文 @zh
type: Concept
preferred label: pregledni članak
preferred label: 综述文章 @zh
preferred label: レビュー論文 @ja
alternative label: прегледни научни чланак
alternative label: article de synthèse @fr
alternative label: journal commentary @en
alternative label: derleme makale @tr
preferred label: artículo de revisión @es
alternative label: 综述评论性文章 @zh
preferred label: مقال نقد @ar

геномски подаци
preferred label: dados genómicos @pt
broader: скуп података
preferred label: dati genomici @it
preferred label: donnée génomique @fr
in scheme: Resource Types
preferred label: 基因组数据 @zh
preferred label: dades genòmiques @ca
type: Concept
preferred label: genomische data @nl
preferred label: genomski podatki @sl
preferred label: геномные данные @ru
preferred label: genomic data @en
preferred label: genomski podaci
preferred label: ゲノムデータ @ja
preferred label: genomidata @fi
preferred label: genomik veri @tr
preferred label: datos genómicos @es
definition: Genomic data refers to the genome and DNA data of an organism. They are used in bioinformatics for collecting, storing and processing the genomes of living things. Genomic data is a more extensive term than sequencing data. However genomic data mostly come from sequencing techniques. It may include non-sequencing data such as data from microarrays, data from real-time PCR panels and data from pharmacogenomics studies. [Source: Adapted from https://www.techopedia.com/definition/31247/genomic-data] @en
preferred label: Genomdaten @de

patent
narrower: патентирана сорта
preferred label: براءة الاختراع @ar
type: Concept
alternative label: patente de invención @es
definition: A set of exclusive rights granted by law to applicants for inventions that are new, non-obvious and commercially applicable. A patent is valid for a limited period (generally 20 years), during which time patent holders can commercially exploit their inventions on an exclusive basis. [Source: https://www.wipo.int/edocs/pubdocs/en/wipo_pub_943_2018.pdf] @en
alternative label: patente de invencion @es
preferred label: 特許 @ja
narrower: патентна пријава
alternative label: patents @en
preferred label: patente @pt
narrower: патентирани софтвер
alternative label: 專利 @zh
preferred label: 专利 @zh
narrower: мали патент
preferred label: patentti @fi
narrower: заштићена биљна сорта
top concept of: Resource Types
preferred label: brevet @fr
preferred label: патент
preferred label: Patent @de
preferred label: brevetto @it
broad match: Text
narrower: патент за дизајн
in scheme: Resource Types
definition: A patent or patent application. @en

индустријски дизајн
preferred label: tuotesuunnnitelma @fi
preferred label: industrijsko oblikovanje @sl
preferred label: industrial design @en
definition: Industrial designs are applied to a wide variety of industrial products and handicrafts. They refer to the ornamental or aesthetic aspects of a useful article,including compositions of lines or colors or any three-dimensional forms that give a special appearance to a product or handicraft. [Source: https://www.wipo.int/edocs/pubdocs/en/wipo_pub_943_2018.pdf] @en
preferred label: 工业图纸 @zh
preferred label: endüstriyel tasarım @tr
preferred label: промышленный дизайн @ru
alternative label: dessin industriel @fr
preferred label: industrieel ontwerp @nl
preferred label: 工業デザイン @ja
preferred label: diseño industrial @es
preferred label: schema industriale @it
broader: dizajn
preferred label: schéma industriel @fr
preferred label: industrijski dizajn
in scheme: Resource Types
preferred label: disseny industrial @ca
type: Concept

recenzija
preferred label: akran değerlendirmesi @tr
preferred label: 同行评议 @zh
preferred label: vertaisarviointi @fi
preferred label: revisión por pares @es
alternative label: revisió entre iguals @ca
broader: prikaz
alternative label: hakem değerlendirmesi @tr
preferred label: экспертная оценка @ru
in scheme: Resource Types
preferred label: peerreview @nl
alternative label: научна или стручна рецензија
type: Concept
alternative label: collegiale toetsing @nl
definition: An evaluation of scientific, academic, or professional work by others working in the same field. [Source: Adopted from https://schema.datacite.org/meta/kernel-4.4/doc/DataCite-MetadataKernel_v4.4.pdf] @en
preferred label: strokovna ocena @sl
preferred label: рецензија
preferred label: avaluació d'experts @ca
alternative label: revisió per parells @ca
alternative label: validation par les pairs @fr
preferred label: 査読 @ja
preferred label: peer review @en
preferred label: revisione tra pari @it
alternative label: revisió d'experts @ca
alternative label: naučna ili stručna recenzija
preferred label: évaluation par les pairs @fr
preferred label: Gutachten @de

необјављен постер са конференције
preferred label: conferentie poster niet in proceedings @nl
preferred label: konferenční poster nezahrnutý ve sborníku @cs
preferred label: poster dans une conférence non publié dans les actes @fr
preferred label: poster @sl
alternative label: 未發表在會議論文集中的海報 @zh
preferred label: póster no publicado en actas de congreso @es
alternative label: póster não publicado nas atas do congresso @pt
preferred label: póster não publicado nas atas da conferência @pt
preferred label: poster non pubblicato in atti di congresso @it
broader: конференцијски прилог
definition: A display poster, typically containing text with illustrative figures and/or tables, usually reporting research results or proposing hypotheses, submitted for acceptance to and/or presented at a conference, seminar, symposium, workshop or similar event. Use this label when the poster is not published in a proceeding. [Source: http://purl.org/spar/fabio/ConferencePoster] @en
alternative label: poster de conférence non publié dans les actes @fr
preferred label: pòster de congrés no publicat @ca
preferred label: стендовый доклад не включенный в материалы конференции @ru
preferred label: 非会议集里的会议海报/会议板报 @zh
preferred label: posteri erillisjulkaisuna @fi
alternative label: plakat @sl
preferred label: yayınlanmamış konferans posteri @tr
preferred label: neobjavljen poster sa konferencije
preferred label: conference poster not in proceedings @en
in scheme: Resource Types
preferred label: Konferenzposter nicht im Tagungsband @de
editorial note: Proposed deprecated @en
type: Concept
preferred label: 会議発表ポスター（会議録未掲載） @ja

патентирани софтвер
preferred label: Softwarepatent @de
preferred label: patent de programari @ca
preferred label: brevetto software @it
preferred label: softwarepatent @nl
broader: patent
preferred label: 软件著作权 @zh
preferred label: патент на программное обеспечение @ru
in scheme: Resource Types
definition: In order to obtain a patent, a software invention must not fall under other non-patentable subject matter (for example, abstract ideas or mathematical theories) and has to fulfill the other substantive patentability criteria (for example, novelty, inventive step [non-obviousness] and industrial applicability [usefulness]). [Source: https://www.wipo.int/patents/en/faq_patents.html] @en
preferred label: brevet de logiciel @fr
preferred label: software patent @en
preferred label: yazılım patenti @tr
alternative label: octrooi op software @nl
preferred label: patent za programsko opremo @sl
alternative label: brevet logiciel @fr
preferred label: ohjelmistopatentti @fi
alternative label: softverski patent
alternative label: 软件专利 @zh
preferred label: patentirani softver
preferred label: ソフトウェア特許 @ja
preferred label: patente de software @es
type: Concept
alternative label: софтверски патент

научни чланак
alternative label: originalni naučni rad
preferred label: مقال بحث @ar
alternative label: публикация в научном журнале @ru
preferred label: Forschungsartikel @de
alternative label: исследовательская статья @ru
preferred label: 原著論文 @ja
alternative label: 原创研究论文 @zh
preferred label: artículo original @es
preferred label: onderzoeksartikel @nl
preferred label: research article @en
alternative label: article de recherche @fr
editorial note: Published @en
preferred label: původní článek @cs
alternative label: articulo de investigacion @es
alternative label: article científic @ca
preferred label: tutkimusartikkeli @fi
preferred label: naučni članak
preferred label: научная статья @ru
definition: A research article is a primary source, that is, it reports the methods and results of an original study performed by the authors. (adapted from http://apus.libanswers.com/faq/2324) @en
in scheme: Resource Types
alternative label: artículo de investigación @es
alternative label: оригинални научни чланак
preferred label: znanstveni članek @sl
alternative label: articulo original @es
broader: чланак у часопису
preferred label: araştırma makalesi @tr
alternative label: artículo científico @es
alternative label: originalni naučni članak
preferred label: 原创研究文章 @zh
preferred label: article de recerca @ca
alternative label: articulo cientifico @es
alternative label: оригинални научни рад
type: Concept

симулациони подаци
preferred label: dados de simulação @pt
preferred label: simulation data @en
type: Concept
definition: Data resulting from modeling or imitative representation of real-world processes, events, or systems, often using computer programs. For example, a program modeling household consumption responses to indirect tax changes; or a dataset on hypothetical patients and their drug exposure, background conditions, and known adverse events. [Source: Adapted from https://ddialliance.org/Specification/DDI-CV/ModeOfCollection_3.0.html] @en
preferred label: datos de simulación @es
preferred label: simulaatiolla tuotettu data @fi
preferred label: dades de simulacions @ca
preferred label: simulacioni podaci
alternative label: podaci dobijeni simulacijom
in scheme: Resource Types
preferred label: данные моделирования @ru
preferred label: 模拟数据 @zh
preferred label: simülasyon verisi @tr
alternative label: simulatiegegevens @nl
broader: скуп података
alternative label: подаци добијени симулацијом
preferred label: donnée de simulation @fr
preferred label: simulacijski podatki @sl
preferred label: dati di simulazione @it
preferred label: Simulationsdaten @de
preferred label: simulatiedata @nl
preferred label: シミュレーションデータ @ja

mémo
definition: A formal note distributed internally to one or more persons in a company, agency, organization, or institution, with a header indicating the date it was sent and stating to whom it is addressed (To:), from whom it is sent (From:), and the subject of the text (Re:). Unlike a letter, a memo does not require a full salutation or signature at the end of the text--the sender may simply initial his or her name in the header. [Source: https://products.abc-clio.com/ODLIS/odlis_m.aspx#memorandum] @en
alternative label: 備忘錄 @zh
preferred label: memorandum
preferred label: مذكرة @ar
editorial note: Published @en
preferred label: memorando @pt
in scheme: Resource Types
alternative label: memòria @ca
preferred label: меморандум
preferred label: memorándum @es
type: Concept
alternative label: Denkschrift @de
alternative label: razprava @sl
alternative label: comunicado @pt
preferred label: 备忘录 @zh
preferred label: メモランダム @ja
alternative label: circular @pt
preferred label: memoràndum @ca
preferred label: Memorandum @de
preferred label: bilgi notu @tr
preferred label: muistio @fi
alternative label: comunicación @es
broader: извештај

технички извештај
alternative label: 技術報告 @zh
preferred label: technisch rapport @nl
preferred label: tehnično poročilo @sl
preferred label: tekninen raportti @fi
alternative label: informe tecnico @es
preferred label: تقرير تقني @ar
preferred label: テクニカルレポート @ja
type: Concept
editorial note: Published @en
alternative label: reporte tecnico @es
preferred label: technischer Bericht @de
preferred label: 技术报告 @zh
preferred label: tehnički izveštaj
preferred label: технический отчет @ru
in scheme: Resource Types
preferred label: teknik rapor @tr
preferred label: technical report @en
preferred label: technická zpráva @cs
preferred label: rapporto tecnico @it
definition: A document that describes the process, progress, or results of technical or scientific research or the state of a technical or scientific research problem. It might also include recommendations and conclusions of the research. [Source: http://guides.library.cornell.edu/ecommons/types] @en
preferred label: rapport technique @fr
preferred label: informe técnico @es
preferred label: relatório técnico @pt
preferred label: informe tècnic @ca
alternative label: reporte técnico @es
broader: извештај

новински чланак
alternative label: članak u novinama
preferred label: krantenartikel @nl
in scheme: Resource Types
alternative label: чланак у новинама
preferred label: Gazete kupürü @tr
preferred label: газетная статья @ru
preferred label: newspaper article @en
broader: новине
type: Concept
preferred label: article de diari @ca
preferred label: sanomalehtiartikkeli @fi
preferred label: artículo de periódico @es
preferred label: 新聞記事 @ja
alternative label: article de periòdic @ca
preferred label: Zeitungsartikel @de
broad match: Article
definition: Work consisting of a news item appearing in a general-interest newspaper or other general news periodical, containing information of current and timely interest in a field. (Adapted from http://www.reference.md/files/D018/mD018431.html ) @en
preferred label: novinski članak
alternative label: Gazete yazısı @tr
alternative label: articulo de diario @es
editorial note: Published @en
alternative label: artículo de diario @es
alternative label: articulo de periodico @es
preferred label: članek v časopisu @sl
preferred label: articolo di giornale @it
preferred label: article de journal @fr

постер са конференције
alternative label: poster de congrès @fr
alternative label: 會議海報 @zh
alternative label: poster cientifico @es
preferred label: Konferenzposter @de
preferred label: poster na konferenci @cs
alternative label: 會議牆報 @zh
broader: zbornik saopštenja sa konferencije
preferred label: póster de congreso @es
preferred label: póster em conferência @pt
preferred label: posteri @fi
preferred label: conferentieposter @nl
alternative label: poster de congreso @es
preferred label: conference poster @en
preferred label: poster sa konferencije
in scheme: Resource Types
preferred label: стендовый доклад @ru
alternative label: póster @pt
definition: A display poster, published within a conference proceeding, typically containing text with illustrative figures and/or tables, usually reporting research results or proposing hypotheses, submitted for acceptance to and/or presented at a conference, seminar, symposium, workshop or similar event. [Source: Adapted http://purl.org/spar/fabio/ConferencePoster] @en
alternative label: poster @it
preferred label: 会议集里的会议海报/会议板报 @zh
preferred label: 会議発表ポスター @ja
alternative label: 会议墙报 @zh
alternative label: póster em congresso @pt
alternative label: cartel @es
preferred label: konferans posteri @tr
type: Concept
alternative label: ملصق @ar
alternative label: póster científico @es
preferred label: poster in congresso @it
preferred label: ملصق مؤتمر @ar
alternative label: poster de conférence @fr
preferred label: poster dans une conférence @fr
preferred label: pòster de congrés @ca
broad match: Event

патент за дизајн
preferred label: патент на образец @ru
in scheme: Resource Types
alternative label: brevet de design @fr
preferred label: 意匠特許 @ja
preferred label: design patent @en
preferred label: brevet de conception @fr
alternative label: tasarım tescili @tr
preferred label: Eingetragenes Design @de
type: Concept
preferred label: mallipatentti @fi
preferred label: patente de diseño @es
preferred label: modelbescherming @nl
preferred label: tasarım patenti @tr
broader: patent
preferred label: patent za dizajn
preferred label: brevetto di design @it
preferred label: 设计专利 @zh
preferred label: patent za oblikovanje @sl
definition: A patent granted to any person who has invented any new and non-obvious ornamental design for an article of manufacture. The design patent protects only the appearance of an article, but not its structural or functional features. [Source: Adapted from https://www.uspto.gov/patents/basics/types-patent-applications/design-patent-application-guide#def] @en
preferred label: patent de disseny @ca

коментар
in scheme: Resource Types
type: Concept
preferred label: commentary @en
preferred label: comentario @es
preferred label: komentar
broader: prikaz
preferred label: комментарий @pt
definition: A commentary is a more in-depth analysis written to draw attention to a work already published. Commentaries are somewhat like “reviews” in that the author presents his or her analysis of a work and why it would be of interest to a specific audience. [Source: https://www.enago.com/academy/perspective-opinion-and-commentary-pieces] @en
alternative label: değerlendirme @tr
preferred label: 评注 @zh
alternative label: comentari @ca
preferred label: commentaar @nl
preferred label: kritiikki @fi
preferred label: commentaire @fr
preferred label: commentario @it
preferred label: 論評 @ja
preferred label: yorum @tr
preferred label: opinió @ca
preferred label: Kommentar @de

kompilacija podataka
preferred label: 汇编数据 @zh
preferred label: 編集データ @ja
in scheme: Resource Types
type: Concept
alternative label: kompilirani podaci
preferred label: kompilierte Daten @de
preferred label: dades compilades @ca
preferred label: компилација података
preferred label: dati compilati @it
preferred label: компилированные данные @ru
preferred label: derlenmiş veri @tr
preferred label: donnée compilée @fr
preferred label: sestavljeni podatki @sl
preferred label: gecompileerde data @nl
broader: скуп података
preferred label: datos compilados @es
preferred label: yhdistetty data @fi
preferred label: dados compilados @pt
alternative label: компилирани подаци
preferred label: compiled data @en
definition: Data collected or assembled from multiple, often heterogeneous sources that have one or more reference points in common, and at least one of the sources was originally produced for other purposes. The data are incorporated in a new entity. For example, providing data on the number of universities in the last 150 years using a variety of available sources (e.g. finance documents, official statistics, university registers), combining survey data with information about geographical areas from official statistics (e.g. population density, doctors per capita, etc.), or using RSS to collect blog posts or tweets, etc. [Source: Adapted from https://ddialliance.org/Specification/DDI-CV/ModeOfCollection_3.0.html] @en

Resource Types
has top concept: računarski program
has top concept: interaktivna građa
has top concept: zaštitni znak
has top concept: periodična publikacija
has top concept: 期刊文献
has top concept: slika
has top concept: capítulo de relatório
has top concept: остало
has top concept: patent
has top concept: скуп података
has top concept: intervju
has top concept: наставни материјал
has top concept: интерни извештај
modified: 2022-09-29T10:57:37+00:00
type: ConceptScheme
has top concept: tekst
has top concept: dizajn
has top concept: poročilo financerjem raziskave
has top concept: друге врсте извештаја
has top concept: radni proces
has top concept: research data
has top concept: zvučni zapis
has top concept: kartografska građa
description: The Resource Type vocabulary defines concepts to identify the genre of a resource. Such resources, like publications, research data, audio and video objects, are typically deposited in institutional and thematic repositories or published in ejournals. This vocabulary supports a hierarchical model that relates narrower and broader concepts. Multilingual labels regard regional distinctions in language and term. Concepts of this vocabulary are mapped with terms and concepts of similar vocabularies and dictionaries.
creator: Cristina Azorín
creator: Paola Azrilevich
creator: Isabel Bernal
creator: Gültekin Gürdal
creator: Sawsan Habre
creator: Juha Hakala
creator: Yutaka Hayashi
creator: Ilkay Holt
creator: Nie Hua
creator: Hilary Jones
creator: Tomoko Kataoka
creator: Laurence Le Borgne
creator: Ku (Alan) Liping
creator: Marina Losada
creator: Susanna Mornati
creator: Brigit Nonó
creator: Milan Ojsteršek
creator: Pedro Príncipe
creator: Irina Razumova
creator: Jochen Schirrwagen
creator: Milica Sevkusic
creator: Wilko Steinhoff
contributor: COAR Controlled Vocabularies Interest Group

radni proces
preferred label: ワークフロー @ja
preferred label: delovni tok @sl
preferred label: fluxo de trabalho @pt
alternative label: Arbeitsablauf @de
alternative label: flux de travail @fr
alternative label: процедура
preferred label: flux de treball @ca
preferred label: procedura
preferred label: workflow @en
definition: A recorded sequence of connected steps, which may be automated, specifying a reliably repeatable sequence of operations to be undertaken when conducting a particular job, for example an in silico investigation that extracts and processes information from a number of bioinformatics databases. [Source: Adapted from http://purl.org/spar/fabio/Workflow] @en
alternative label: cicle de treball @ca
preferred label: flujo de trabajo @es
preferred label: pracovní postup @cs
preferred label: työnkulku @fi
preferred label: iş akışı @tr
top concept of: Resource Types
preferred label: Workflow @de
alternative label: flux de travaux @fr
preferred label: рабочий процесс @ru
preferred label: سير العمل @ar
alternative label: flusso di lavoro @it
alternative label: 工作流 @zh
preferred label: радни процес
in scheme: Resource Types
alternative label: flux opérationnel @fr
preferred label: 工作流程 @zh
type: Concept

резултат пројекта
type: Concept
preferred label: hankkeen suorite @fi
preferred label: výstup projektu @cs
preferred label: 项目可交付成果 @zh
preferred label: deliverable di progetto @it
preferred label: projectresultaat @nl
preferred label: entrega de projecte @ca
preferred label: результат проекта @ru
preferred label: project deliverable @en
preferred label: プロジェクト報告書 @ja
alternative label: risultato di progetto @it
alternative label: resultado de projeto @pt
alternative label: 項目可交付成果 @zh
preferred label: livrable @fr
alternative label: livrable de projet @fr
alternative label: memoria de proyecto @es
alternative label: produto de projeto @pt
broader: извештај
editorial note: Published @en
alternative label: informes de projectes @ca
preferred label: proje çıktısı @tr
definition: A document containing a project report, intended to be delivered to a customer or funding agency describing the results achieved within a specific project. [Source: http://purl.org/spar/fabio/ProjectReportDocument] @en
preferred label: مشروع للتسليم @ar
alternative label: recensão @pt
preferred label: entregable de proyecto @es
preferred label: izdelek projekta @sl
preferred label: rezultat projekta
preferred label: Ergebnis im Projekt @de
in scheme: Resource Types
preferred label: entregável de projeto @pt

poročilo financerjem raziskave
alternative label: relatório para agência de financiamento @pt
preferred label: 给资助机构的报告 @zh
alternative label: rapport au financeur @fr
preferred label: informe a organismo financiador @es
top concept of: Resource Types
preferred label: relatório para organismo financiador @pt
preferred label: 助成研究成果報告書 @ja
preferred label: fon sağlayıcıya rapor @tr
preferred label: report to funding agency @en
expires: 2021-03-12
alternative label: končno poročilo o rezultatih raziskav @sl
alternative label: poročilo financerjem projekta @sl
preferred label: تقرير لوكالة تمويل @ar
editorial note: Deprecated @en
alternative label: relatório para financiador @pt
alternative label: reporte a agencia de financiamento @es
alternative label: informe a agencia financiadora @es
preferred label: rapporto a un'agenzia di finanziamento @it
preferred label: Bericht an Förderorganisation @de
in scheme: Resource Types
alternative label: rapportage voor financier @nl
preferred label: rapport à l'intention du financeur @fr
type: Concept
preferred label: zpráva pro poskytovatele podpory @cs
preferred label: informe per una agència de finançament @ca
alternative label: 給資助機構的報告 @zh
definition: A report to a funding agency is a document written by beneficiaries of project grants. The reporting documents can be e.g. periodic reports about progress of scientific and technical work and final report. For deliverables use ‘Project deliverable’. [Source: http://ec.europa.eu/research/participants/fp7documents/funding-guide/6_projects/reports/reports_en.htm ] @en

предавање
preferred label: lezione @it
alternative label: conferencia académica @es
alternative label: 演讲 @zh
alternative label: disertación @es
preferred label: lecture @nl
alternative label: 讲课 @zh
narrow match: LectureNotes
preferred label: محاضرة @ar
preferred label: 講演 @ja
alternative label: conferência @pt
preferred label: conferència acadèmica @ca
alternative label: prelecção @pt
preferred label: predavanje
preferred label: 讲座 @zh
alternative label: conferencia academica @es
alternative label: 講座 @zh
alternative label: lição @pt
alternative label: enseignement magistral @fr
preferred label: лекция @ru
alternative label: lectures @en
alternative label: disertacion @es
alternative label: charla magistral @es
alternative label: conferencia @es
alternative label: 演講 @zh
definition: Transcription of an oral presentation/talk intended to present information or teach people about a particular subject, for example by a university or college teacher. [Source: Adopted from https://en.wikipedia.org/wiki/Lecture] @en
preferred label: palestra @pt
alternative label: 講課 @zh
preferred label: luento @fi
preferred label: ponencia @es
alternative label: محاضرات @ar
preferred label: Vorlesung @de
broader: tekst
preferred label: přednáška @cs
in scheme: Resource Types
alternative label: classe magistral @ca
alternative label: preleção @pt
alternative label: conferencia magistral @es
preferred label: ders @tr
type: Concept
preferred label: cours magistral @fr

софтвер за науку
preferred label: Forschungssoftware @de
editorial note: Published @en
preferred label: software per la ricerca @it
alternative label: istraživački softver
preferred label: 研究用ソフトウェア @ja
alternative label: programari d’anàlisi @ca
definition: Software that is used to generate, process or analyse results that you intend to appear in a publication (either in a journal, conference paper, monograph, book or thesis). Research software can be anything from a few lines of code written by yourself, to a professionally developed software package. [Source: https://datashare.ed.ac.uk/handle/10283/785] @en
preferred label: software de investigación @es
alternative label: naučni softver
preferred label: tutkimusohjelmisto @fi
broader: računarski program
preferred label: onderzoekssoftware @nl
alternative label: научни софтвер
in scheme: Resource Types
type: Concept
preferred label: Araştırma yazılımı @tr
preferred label: исследовательское программное обеспечение @ru
alternative label: programari per recerca @ca
preferred label: softver za nauku
alternative label: tutkimussovellus @fi
preferred label: research software @en
preferred label: raziskovalna programska oprema @sl
alternative label: истраживачки софтвер
preferred label: programari acadèmic @ca

izvorni softverski kod
preferred label: ソースコード @ja
preferred label: código fuente @es
preferred label: исходный код @ru
preferred label: codice sorgente @it
preferred label: izvorna koda @sl
definition: Source code is any collection of code, with or without comments, written using a human-readable programming language, usually as plain text. [Source: https://en.wikipedia.org/wiki/Source_code] @en
preferred label: codi font @ca
preferred label: kaynak kodu @tr
alternative label: brontekst @nl
in scheme: Resource Types
preferred label: broncode @nl
preferred label: code source @fr
preferred label: 源代码 @zh
broader: računarski program
type: Concept
preferred label: source code @en
preferred label: Quellcode @de
preferred label: código fonte @pt
preferred label: изворни софтверски код
preferred label: lähdekoodi @fi

агрегирани подаци
preferred label: dados agregados @pt
preferred label: aggregoitu tilastotieto @fi
preferred label: données agrégées @fr
broader: скуп података
preferred label: 聚合数据 @zh
preferred label: dati aggregati @it
preferred label: агрегированные данные @ru
preferred label: dades agregades @ca
in scheme: Resource Types
alternative label: združeni podatki @sl
preferred label: aggregierte Daten @de
preferred label: 集計データ @ja
preferred label: geaggregeerde data @nl
preferred label: aggregated data @en
alternative label: izpeljani podatki @sl
definition: Statistics that relate to broad classes, groups, or categories. The data are averaged, totaled, or otherwise derived from individual-level data, and it is no longer possible to distinguish the characteristics of individuals within those classes, groups, or categories. For example, the number and age group of the unemployed in specific geographic regions, or national level statistics on the occurrence of specific offences, originally derived from the statistics of individual police districts. [Source: https://ddialliance.org/Specification/DDI-CV/ModeOfCollection_3.0.html] @en
preferred label: agregirani podaci
preferred label: agregirani podatki @sl
preferred label: birleştirilmiş veri @tr
preferred label: datos agregados @es
type: Concept

dizajn
preferred label: diseño @es
narrower: схема конфигурације
preferred label: disseny @ca
preferred label: oblikovanje @sl
type: Concept
preferred label: ontwerp @nl
in scheme: Resource Types
preferred label: schéma @fr
preferred label: design @en
narrower: индустријски дизајн
preferred label: 设计 @zh
preferred label: デザイン @ja
preferred label: suunnitelma @fi
definition: Plans, drawing or set of drawings showing how something e.g. building, product is to be made and how it will work and look. [Source: Adapted from https://dictionary.cambridge.org/dictionary/english/design] @en
top concept of: Resource Types
preferred label: tasarım @tr
preferred label: дизайн @ru
preferred label: дизајн

interaktivna građa
preferred label: 互动资源 @zh
preferred label: interaktivní zdroj @cs
alternative label: contributo a convegno @it
preferred label: интерактивный ресурс @ru
alternative label: 互動資源 @zh
top concept of: Resource Types
preferred label: مورد تفاعلي @ar
alternative label: 交互式資源 @zh
alternative label: interaktivni vir @sl
in scheme: Resource Types
preferred label: recurso interativo @pt
type: Concept
preferred label: interaktiivinen resurssi @fi
preferred label: recurs interactiu @ca
preferred label: ressource interactive @fr
preferred label: インタラクティブリソース @ja
preferred label: risorsa interattiva @it
alternative label: 交互式资源 @zh
alternative label: interaktivni resurs
definition: A resource requiring interaction from the user to be understood, executed, or experienced. Examples include forms on Web pages, applets, multimedia learning objects, chat services, or virtual reality environments. Source: http://purl.org/dc/dcmitype/InteractiveResource @en
narrower: veb-sajt
preferred label: interactieve bron @nl
preferred label: interactive resource @en
preferred label: recurso interactivo @es
preferred label: interaktive Ressource @de
alternative label: интерактивни ресурс
preferred label: интерактивна грађа
preferred label: etkileşimli kaynak @tr

интерни извештај
preferred label: interní zpráva @cs
preferred label: relatório interno @pt
expires: 2021-03-12
preferred label: interner Bericht @de
preferred label: dahili rapor @tr
top concept of: Resource Types
definition: An internal report is a record of findings collected for internal use. It is not designed to be made public and may include confidential or proprietary information. @en
preferred label: interno poročilo @sl
preferred label: rapport interne @fr
in scheme: Resource Types
preferred label: informe intern @ca
type: Concept
preferred label: intern rapport @nl
alternative label: 內部報告 @zh
preferred label: 内部报告 @zh
preferred label: 内部報告書 @ja
preferred label: internal report @en
preferred label: تقرير داخلي @ar
preferred label: informe interno @es
preferred label: rapporto interno @it
alternative label: reporte de uso interno @es
editorial note: Deprecated @en
alternative label: notranje poročilo @sl
preferred label: interni izveštaj

необјављено саопштење са конференције
alternative label: article de conférence non publié dans les actes @fr
preferred label: article dans une conférence non publié dans les actes @fr
alternative label: conferencepaper not in proceedings @en
preferred label: konferenční příspěvek nezahrnutý ve sborníku @cs
preferred label: konferenssiesitelmä erillisjulkaisuna @fi
definition: A paper, typically the realization of a research paper reporting original research findings. Use this label when the paper is not published in a proceeding. [Source: Adapted from http://purl.org/spar/fabio/ConferencePaper] @en
preferred label: comunicação não publicada nas atas da conferência @pt
preferred label: neobjavljen članek na konferenci @sl
type: Concept
preferred label: yayınlanmamış konferans bildirisi @tr
preferred label: conference paper not in proceedings @en
preferred label: comunicació de congrés no publicada @ca
preferred label: neobjavljeno saopštenje sa konferencije
broader: конференцијски прилог
preferred label: comunicación no publicada en actas de congreso @es
preferred label: 会議発表論文（会議録未掲載） @ja
alternative label: artigo não publicado nas atas do congresso @pt
preferred label: конференционный доклад не включенный в материалы конференции @ru
alternative label: artigo não publicado nas atas da conferência @pt
in scheme: Resource Types
preferred label: Konferenzbeitrag nicht im Tagungsband @de
editorial note: Proposed deprecated @en
preferred label: 非会议集里的会议论文 @zh
alternative label: comunicação não publicada nas atas do congresso @pt
preferred label: conferentie artikel niet in proceedings @nl
alternative label: 未發表在會議論文集中的文章 @zh
preferred label: comunicazione non pubblicata in atti di congresso @it

rukopis
definition: A manuscript is a work of any kind (text, inscription, music score, map, etc.) written entirely by hand. [Source: https://products.abc-clio.com/ODLIS/odlis_m.aspx] @en
preferred label: manuscrito @es
preferred label: Manuskript @de
editorial note: Published @en
preferred label: manuscript @nl
in scheme: Resource Types
alternative label: rokopis @sl
preferred label: manuscrit @ca
alternative label: рукописна грађа
broader: tekst
preferred label: 手稿 @ja
alternative label: handschrift @nl
alternative label: rukopisna građa
alternative label: El yazması @tr
preferred label: käsikirjoitus @fi
alternative label: document original @ca
preferred label: Yazma eser @tr
type: Concept
preferred label: рукопись @ru
preferred label: manoscritto @it
preferred label: рукопис
alternative label: манускрипт @ru

doktorska disertacija
broader: teza
alternative label: mémoire de thèse de doctorat @fr
preferred label: tesi di dottorato @it
preferred label: disertační práce @cs
preferred label: اطروحة دكتوراه @ar
in scheme: Resource Types
preferred label: 博士学位论文 @zh
alternative label: doktorsko delo @sl
definition: A thesis reporting the research undertaken during a period of graduate study leading to a doctoral degree. [Source: http://purl.org/spar/fabio/DoctoralThesis] @en
preferred label: thèse de doctorat @fr
alternative label: 博士研究生毕业文论 @zh
preferred label: докторская диссертация @ru
alternative label: dissertatie @nl
preferred label: tesi doctoral @ca
preferred label: tese de doutoramento @pt
preferred label: väitöskirja @fi
alternative label: doktorská práce @cs
alternative label: اطروحة @ar
alternative label: dissertation @en
alternative label: 博士學位論文 @zh
preferred label: doctoral thesis @en
preferred label: 博士論文 @ja
preferred label: докторска дисертација
alternative label: rapport de thèse de doctorat @fr
type: Concept
preferred label: Dissertation @de
preferred label: tesis doctoral @es
alternative label: 博士研究生畢業論文 @zh
alternative label: PhD Thesis @en
alternative label: Habilitation @de
preferred label: proefschrift @nl
broad match: Thesis
preferred label: doktora tezi @tr
alternative label: tesis de doctorado @es

video
preferred label: Video @de
alternative label: видео запис
alternative label: video zapis
preferred label: 録画資料 @ja
broad match: Movie
preferred label: видео
alternative label: 視頻 @zh
preferred label: فيد يو @ar
type: Concept
editorial note: Published @en
preferred label: vídeo @pt
in scheme: Resource Types
alternative label: 動態影像 @zh
broad match: MovingImage
alternative label: 动态影像 @zh
preferred label: 视频 @zh
broader: pokretne slike
definition: A recording of visual images, usually in motion and with sound accompaniment. [Source: http://www.ifla.org/files/assets/cataloguing/isbd/isbd-cons_20110321.pdf ] @en
preferred label: vidéo @fr

statična slika
alternative label: statična vizuelna predstava
alternative label: 靜態圖像 @zh
alternative label: 靜止圖像 @zh
preferred label: immagine fissa @it
alternative label: afbeelding @nl
preferred label: 静止画 @ja
preferred label: still image @en
broader: slika
preferred label: imagen fija @es
preferred label: статична слика
broad match: Image
preferred label: imagem estática @pt
definition: A recorded static visual representation. This class of image includes diagrams, drawings, graphs, graphic designs, plans, photographs and prints. [Source: Adapted from http://purl.org/spar/fabio/StillImage] @en
preferred label: Einzelbild @de
alternative label: imatge estàtica @ca
preferred label: صورة ثابته @ar
preferred label: неподвижное изображение @ru
preferred label: image fixe @fr
preferred label: imatge fixa @ca
preferred label: nepohyblivý obraz @cs
preferred label: stilstaandbeeld @nl
preferred label: statična vizualna predstavitev @sl
preferred label: 静态图像 @zh
alternative label: 静止图像 @zh
in scheme: Resource Types
type: Concept
preferred label: hareketsiz görüntü @tr
alternative label: imagem fixa @pt
alternative label: imagem @pt
alternative label: статична визуелна представа
preferred label: still-kuva @fi

analiza politike
preferred label: politika raporu @tr
preferred label: Policy Report @de
preferred label: politiikkaraportti @fi
preferred label: informe de política @ca
preferred label: informativa politica @it
in scheme: Resource Types
preferred label: 政策报告 @zh
preferred label: relatório de política @pt
alternative label: 政策報告 @zh
preferred label: strateško poročilo @sl
alternative label: informe de gestió @ca
preferred label: memoria de actuación @es
preferred label: zpráva k politice nebo strategii @cs
preferred label: отчет о политике @ru
broader: извештај
alternative label: informe de gestión @es
alternative label: informe sobre políticas @es
definition: A policy report presents what is known about a particular issue or problem. It assembles facts and evidence to help readers understand complex issues and form a response. It might aim to be neutral, or it might aim to persuade readers in a particular direction. [Source: https://www.uow.edu.au/student/learning-co-op/assessments/policy-report/#] @en
alternative label: Strategiepapier @de
alternative label: memoria de protocolo de actuación @es
alternative label: Grundsatzpapier @de
preferred label: анализа политике
preferred label: rapport stratégique @fr
type: Concept
preferred label: ポリシーレポート @ja
editorial note: Deprecated @en
preferred label: beleidsrapport @nl
preferred label: policy report @en
alternative label: informe de actuación @es
preferred label: تقرير عن السياسات @ar

zbornik saopštenja sa konferencije
alternative label: اعمال المؤتمر @ar
alternative label: 会刊 @zh
preferred label: actes de congrés @ca
in scheme: Resource Types
preferred label: Tagungsband @de
alternative label: actas de conferência @pt
alternative label: اوراق المؤتمر @ar
preferred label: actas de congreso @es
type: Concept
preferred label: 会议论文集 @zh
preferred label: konferans bildirileri @tr
alternative label: actas de conferencia @es
preferred label: وقائع المؤتمر @ar
narrower: saopštenje sa konferencije
preferred label: konferenssijulkaisu @fi
preferred label: conference proceedings @en
alternative label: libro de ponencias @es
alternative label: zbornik radova sa konferencije
alternative label: actas de congresso @pt
preferred label: zbornik prispevkov na konferenci @sl
preferred label: 会議録 @ja
alternative label: акта конгреса
alternative label: akta kongresa
preferred label: материалы конференций @ru
alternative label: llibre de ponències @ca
preferred label: sborník konference @cs
narrower: постер са конференције
preferred label: зборник саопштења са конференције
preferred label: actes de conférence @fr
alternative label: 會議論文集 @zh
alternative label: зборник радова са конференције
alternative label: atas de congresso @pt
preferred label: atti di congresso @it
alternative label: actes de congrès @fr
definition: Conference proceedings is the official record of a conference meeting. It is a collection of documents which corresponds to the presentations given at the conference. It may include additional content. [Source: http://www.ieee.org/documents/confprocdefined.pdf ] @en
alternative label: 會刊 @zh
preferred label: atas de conferência @pt
broader: конференцијски прилог

геопросторни подаци
alternative label: просторни подаци
type: Concept
preferred label: paikkatieto @fi
preferred label: donnée géospatiale @fr
alternative label: locatie data @nl
preferred label: coğrafi uzamsal veri @tr
preferred label: Geodaten @de
preferred label: geoprostorski podatki @sl
preferred label: 地理空间数据 @zh
definition: Geospatial data are any type of data with spatial coordinates that allow them to be mapped to the Earth's surface. They can represent physical objects, discrete areas or continuous surfaces. Discrete geospatial data are usually represented using vector data consisting of points, lines and polygons, while continuous geospatial data are usually represented by raster data, consisting of a grid of cells that each has its own value. Any number of applications in a wide range of areas produce geospatial data, such as GIS, Remote Sensing equipment, GPS units, archaeological total stations, manual mapping and computer-aided design (CAD), in a number of formats, including images, vector, text, and tabular data. Vector-based geospatial data include tables listing archaeological sites along with their coordinates, text-based files (e.g., XML) containing coordinates and topology for historic road networks, voting figures for political parties by administrative area. Raster-based geospatial data include satellite images, aerial photographs, scanned maps, and digital maps of elevations, vegetation, land-use, sea surface temperatures, air pollution, soil-types, etc. [Source: https://ddialliance.org/Specification/DDI-CV/GeneralDataFormat_2.0.html] @en
preferred label: geoprostorni podaci
in scheme: Resource Types
preferred label: 地理空間データ @ja
preferred label: dados geoespaciais @pt
alternative label: jeo uzamsal veri @tr
preferred label: dati geospaziali @it
preferred label: geospatial data @en
preferred label: геопространственные данные @ru
broader: скуп података
alternative label: prostorni podaci
preferred label: datos geoespaciales @es
alternative label: dades geogràfiques @ca
preferred label: dades geoespacials @ca
preferred label: geospatiale gegevens @nl

приказ књиге
alternative label: resenha de livro @pt
preferred label: kirja-arvostelu @fi
alternative label: ficha de leitura @pt
preferred label: recensione di libro @it
preferred label: kitap eleştirisi @tr
alternative label: crítica de llibre @ca
preferred label: reseña de libro @es
preferred label: рецензия на книгу @ru
preferred label: prikaz knjige
alternative label: recension d'ouvrage @fr
alternative label: recensão crítica @pt
preferred label: 書評 @ja
broader: prikaz
alternative label: book reviews @en
alternative label: Buchbesprechung @de
preferred label: مراجعة كتاب @ar
type: Concept
definition: A written review and critical analysis of the content, scope and quality of a book or other monographic work. [Source: http://purl.org/spar/fabio/BookReview] @en
preferred label: recensão de livro @pt
alternative label: comentario de libro @es
alternative label: critica de libro @es
preferred label: boekbespreking @nl
alternative label: boek review @nl
preferred label: ressenya de llibre @ca
alternative label: Buchkritik @de
alternative label: critique de livre @fr
alternative label: recensión de libro @es
alternative label: recensió de llibre @ca
preferred label: book review @en
preferred label: recenzija knjige @sl
preferred label: note de lecture @fr
alternative label: crítica de libro @es
in scheme: Resource Types
alternative label: نقد كتاب @ar
preferred label: Buchrezension @de
alternative label: recension de libro @es
preferred label: 书评 @zh
preferred label: recenze knihy @cs

информативна ревија
preferred label: revista divulgativa @es
alternative label: revista de divulgación científica @es
preferred label: informativna revija
definition: A popular interest periodical usually containing articles on a variety of topics, written by various authors in a nonscholarly style or a trade publication, unlike a consumer publication, covers a specific topic for people who work in that particular field or industry. [Source: Adapted from https://www.thebalance.com/what-is-a-trade-publication-exactly-2316039 and http://www.abc-clio.com/ODLIS/odlis_m.aspx] @en
preferred label: magazine @fr
alternative label: časnik @sl
type: Concept
editorial note: Published @en
preferred label: Informationszeitschrift @de
alternative label: magazin
preferred label: tijdschrift @nl
alternative label: časopis
preferred label: 雑誌 @ja
alternative label: revista de divulgacion cientifica @es
alternative label: revista de divulgación @es
preferred label: aikakauslehti @fi
broader: tekst
preferred label: периодическое печатное издание @ru
alternative label: часопис
alternative label: revista de divulgacion @es
in scheme: Resource Types
preferred label: revista de divulgació @ca
alternative label: магазин
preferred label: Magazin @tr
preferred label: rivista divulgativa @it

prikaz
alternative label: recensão crítica @pt
alternative label: crítica @es
preferred label: рецензия @ru
alternative label: derleme @tr
preferred label: synthèse @fr
preferred label: recensão @pt
alternative label: نقد @ar
in scheme: Resource Types
alternative label: 评审 @zh
alternative label: comentario @es
alternative label: recensió @ca
preferred label: Rezension @de
alternative label: revisão @pt
definition: A review of others' published work. [Source: Adapted from http://purl.org/spar/fabio/Review] @en
alternative label: 評論 @zh
preferred label: مراجعة @ar
alternative label: 综述 @zh
alternative label: kritički prikaz
alternative label: recension @es
alternative label: resenha @pt
preferred label: 评论 @zh
broad match: Text
narrower: коментар
broader: tekst
alternative label: revisió @ca
preferred label: ressenya @ca
preferred label: eleştiri @tr
alternative label: rassegna @it
preferred label: review @nl
preferred label: recenzija
type: Concept
preferred label: arvio @fi
alternative label: critica @es
alternative label: comentari @ca
narrower: приказ књиге
preferred label: recensione @it
preferred label: приказ
preferred label: reseña @es
preferred label: レビュー @ja
alternative label: article de synthèse @fr
alternative label: bespreking @nl
alternative label: 評審 @zh
alternative label: критички приказ
narrower: recenzija
alternative label: 綜述 @zh
alternative label: рецензија
alternative label: recensión @es
preferred label: recenze @cs

laboratorijske beleške
preferred label: laboratuvar defteri @tr
alternative label: quadern de camp @ca
preferred label: laboratoriopäiväkirja @fi
preferred label: cuaderno de laboratorio @es
preferred label: Laborjournal @de
alternative label: cuaderno electrónico de laboratorio @es
type: Concept
preferred label: llibreta de laboratori @ca
alternative label: cahier de laboratoire @fr
preferred label: 実験ノート @ja
preferred label: лабораторный блокнот @ru
alternative label: quadern de laboratori @ca
preferred label: 实验室记录本 @zh
alternative label: laboratorijski zapis @sl
preferred label: лабораторијске белешке
broader: скуп података
definition: A laboratory notebook (colloq. lab notebook or lab book) is a primary record of research. Researchers use a lab notebook to document their hypotheses, experiments and initial analysis or interpretation of these experiments. This label is used both for traditional and electronic laboratory notebook. [Source: Adapted from https://en.wikipedia.org/wiki/Lab_notebook] @en
preferred label: laboratorium-notitieboek @nl
preferred label: quaderno di laboratorio @it
preferred label: caderno de laboratório @pt
preferred label: laboratorijska beležka @sl
alternative label: laboratorijski zvezek @sl
preferred label: laboratory notebook @en
preferred label: carnet de laboratoire @fr
in scheme: Resource Types
alternative label: elektronik laboratuvar defteri @tr

подаци мерења и испитивања
preferred label: datos de medición y prueba @es
preferred label: merilni in testni podatki @sl
preferred label: данные измерений и испытаний @ru
preferred label: Mess- und Testdaten @de
preferred label: meet- en testdata @nl
preferred label: 測定・評価データ @ja
definition: Data resulting from assessing specific properties (or characteristics) of beings, things, phenomena, (and/ or processes) by applying pre-established standards and/or specialized instruments or techniques. [Source: Adapted from https://ddialliance.org/Specification/DDI-CV/ModeOfCollection_3.0.html] @en
preferred label: dados de medição e de ensaio @pt
preferred label: donnée de mesure et d'essai @fr
preferred label: mittaus- ja testausdata @fi
preferred label: ölçüm ve test verisi @tr
preferred label: dades de mesures i proves @ca
preferred label: 测量与测试数据 @zh
in scheme: Resource Types
preferred label: dati di misurazione e test @it
broader: скуп података
type: Concept
preferred label: measurement and test data @en
preferred label: podaci merenja i ispitivanja

zaštitni znak
preferred label: торговая марка @ru
preferred label: trademark @en
alternative label: ticari marka @tr
top concept of: Resource Types
alternative label: símbol @ca
preferred label: blagovna znamka @sl
alternative label: marque commerciale @fr
in scheme: Resource Types
preferred label: marca @es
alternative label: logosímbol @ca
preferred label: logo @ca
preferred label: заштитни знак
preferred label: marka @tr
preferred label: handelsmerk @nl
preferred label: Warenzeichen @de
preferred label: marchio depositato @it
definition: A sign used to distinguish the goods or services of one undertaking from those of others. A trademark may consist of words and combinations of words (for instance, names or slogans), logos, figures and images, letters, numbers, sounds, or, in rare instances, smells or moving images, or a combination thereof. [Source: https://www.wipo.int/trademarks/en] @en
preferred label: 商標 @ja
preferred label: tavaramerkki @fi
type: Concept
preferred label: 商标 @zh
preferred label: marque déposée @fr

схема конфигурације
preferred label: načrt postavitve @sl
preferred label: layout di impianto @it
definition: Layout-design (topography) means the three-dimensional disposition, however expressed, of the elements of an integrated circuit (at least one of which is an active element) and of some or all of the interconnections of an integrated circuit, or such a three-dimensional disposition prepared for an integrated circuit intended for manufacture [Source: https://www.wipo.int/edocs/lexdocs/laws/en/hk/hk028en.pdf] @en
alternative label: kytkentäkaavio @fi
preferred label: piirikaavio @fi
preferred label: layout design @en
in scheme: Resource Types
preferred label: レイアウト設計 @ja
alternative label: макетирование @ru
broader: dizajn
preferred label: shema konfiguracije
preferred label: компоновка @ru
preferred label: topoğrafya @tr
type: Concept
preferred label: lay-out ontwerp @nl
preferred label: disseny de maqueta @ca
preferred label: schéma de configuration @fr
preferred label: 布图设计 @zh
preferred label: topografía de productos semiconductores @es
alternative label: maquetació @ca
alternative label: schéma d'implantation @fr

kodirani podaci
alternative label: donnée codée @fr
preferred label: 编码数据 @zh
preferred label: donnée encodée @fr
type: Concept
preferred label: datos codificados @es
preferred label: dados codificados @pt
preferred label: kodierte Daten @de
preferred label: kodirani podatki @sl
preferred label: dades codificades @ca
definition: Qualitative data (textual, video, audio or still-image) originally produced for other purposes into quantitative data (expressed in unit-by-variable matrices) by using coding techniques in accordance with pre-defined categorization schemes. For example, coded party manifesto data like the "European Parliament Election Study 2009, Manifesto Study" (doi:10.4232/1.10204)". [Source: Adapted from https://ddialliance.org/Specification/DDI-CV/ModeOfCollection_3.0.html] @en
preferred label: kodlanmış veri @tr
preferred label: encoded data @en
in scheme: Resource Types
preferred label: dati codificati @it
preferred label: кодированные данные @ru
preferred label: кодирани подаци
preferred label: koodattu data @fi
broader: скуп података
preferred label: 符号化データ @ja
preferred label: geëncodeerde data @nl

подаци прикупљени посматрањем
alternative label: dades d'observació @ca
broader: скуп података
editorial note: Data resulting from observational research, which involves collecting observations as they occur (for example, observing behaviors, events, development of condition or disease, etc.), without attempting to manipulate any of the independent variables. [Source: Adapted from https://ddialliance.org/Specification/DDI-CV/ModeOfCollection_3.0.html] @en
type: Concept
preferred label: dati osservazionali @it
preferred label: 観測データ @ja
preferred label: podaci prikupljeni posmatranjem
preferred label: havaintoaineisto @fi
preferred label: observational data @en
preferred label: gözlemsel veri @tr
preferred label: 观测数据 @zh
in scheme: Resource Types
preferred label: donnée d'observation @fr
preferred label: данные наблюдений @ru
preferred label: dades observacionals @ca
preferred label: dados observacionais @pt
preferred label: opazovalni podatki @sl
preferred label: observatiedata @nl
preferred label: datos observacionales @es
definition: Data resulting from observational research, which involves collecting observations as they occur (for example, observing behaviors, events, development of condition or disease, etc.), without attempting to manipulate any of the independent variables. [Source: Adapted from https://ddialliance.org/Specification/DDI-CV/ModeOfCollection_3.0.html] @en
preferred label: Beobachtungsdaten @de

мали патент
broader: patent
preferred label: modèle d'utilité @fr
preferred label: полезная модель @ru
preferred label: gebruiksmodel @nl
preferred label: Gebrauchsmuster @de
preferred label: modelo de utilidad @es
preferred label: 実用新案 @ja
preferred label: mali patent
type: Concept
preferred label: utility model @en
preferred label: modello di utilità @it
preferred label: model d'utilitat @ca
definition: A special form of patent right granted by a state or jurisdiction to an inventor or the inventor’s assignee for a fixed period of time. The terms and conditions for granting a utility model are slightly different from those for normal patents (including a shorter term of protection and less stringent patentability requirements). The term can also describe what are known in certain countries as “petty patents,” “short-term patents” or “innovation patents.” [Source: https://www.wipo.int/edocs/pubdocs/en/wipo_pub_943_2018.pdf] @en
preferred label: patent s skrajšanim trajanjem @sl
preferred label: hyödyllisyysmalli @fi
preferred label: faydalı model @tr
preferred label: 实用新型专利 @zh
in scheme: Resource Types

транскрипт
preferred label: transcriptie @nl
preferred label: 文字起こし @ja
alternative label: 誊写记录 @zh
definition: A written record of words spoken in court proceedings or in a speech, interview, broadcast, or sound recording. [Source: Adapted from https://products.abc-clio.com/ODLIS/odlis_t.aspx] @en
preferred label: transkripsiyon @tr
preferred label: transkripcija @sl
preferred label: transcripció @ca
alternative label: prepis @sl
in scheme: Resource Types
preferred label: Transkription @de
preferred label: 转录资料 @zh
preferred label: transcription @fr
broader: tekst
preferred label: trascrizione @it
preferred label: transcripción @es
type: Concept
preferred label: transkript
preferred label: транскрипция @ru
preferred label: litteroitu teksti @fi

snimljeni podaci
alternative label: zabeleženi podatki @sl
alternative label: geregistreerde gegevens @nl
preferred label: vastgelegde data @nl
preferred label: 記録データ @ja
alternative label: datos grabados @es
preferred label: dados registados @pt
preferred label: posneti podatki @sl
preferred label: dades enregistrades @ca
broader: скуп података
preferred label: tallennettu data @fi
preferred label: снимљени подаци
preferred label: datos registrados @es
definition: Data registered by mechanical or electronic means, in a form that allows the information to be retrieved and/or reproduced. For example, images or sounds on disc or magnetic tape. [Source: Adapted from https://ddialliance.org/Specification/DDI-CV/ModeOfCollection_3.0.html] @en
preferred label: kaydedilmiş veri @tr
preferred label: recorded data @en
preferred label: dati registrati @it
alternative label: opgenomen data @nl
preferred label: 记录数据 @zh
in scheme: Resource Types
preferred label: записанные данные @ru
type: Concept
preferred label: aufgezeichnete Daten @de
preferred label: donnée enregistrée @fr

research data
type: Concept
definition: Data that are used as primary sources to support technical or scientific enquiry, research, scholarship, or artistic activity, and that are used as evidence in the research process and/or are commonly accepted in the research community as necessary to validate research findings and results. [Source: https://casrai.org/term/research-data] @en
expires: 2021-04-01
top concept of: Resource Types
in scheme: Resource Types