tekst
narrower: radni dokument
narrower: транскрипт
preferred label: text @ca
narrower: предлог истраживачког пројекта
preferred label: teksti @fi
narrower: konferencijski prilog
preferred label: текст
narrower: приказ
narrower: информативна ревија
preferred label: texto @gl
alternative label: 文檔 @zh
narrower: писмо
narrower: нотни запис
preferred label: metin @tr
narrower: predavanje
preferred label: testo @it
preferred label: texte @fr
preferred label: 文本 @zh
preferred label: szöveg @hu
narrower: časopis
editorial note: Published @en
narrower: versión enviada
narrower: novine
preferred label: 텍스트 @ko
preferred label: κείμενο @el
top concept of: Resource Types
alternative label: 文档 @zh
definition: A resource consisting primarily of words for reading. Examples include books, letters, dissertations, poems, newspapers, articles, archives of mailing lists. Note that facsimiles or images of texts are still of the genre Text. [Source: http://purl.org/dc/dcmitype/Text] @en
preferred label: نص @ar
preferred label: Text @de
narrower: извештај
narrower: knjiga
preferred label: テキスト @ja
preferred label: besedilo @sl
narrower: rukopis
narrower: tekst na blogu
narrower: ostale periodične publikacije
narrower: теза
narrower: анотација
narrower: техничка документација
in scheme: Resource Types
narrower: библиографија
type: Concept

чланак у часопису
alternative label: articulo @es
alternative label: article de périodique @fr
alternative label: 저널 논문 @ko
alternative label: article scientifique @fr
alternative label: artikel i vetenskaplig tidskrift @sv
alternative label: rad u časopisu
preferred label: tidsskriftartikel @da
preferred label: articol de revistă @ro
alternative label: artículo revisado por pares @es
definition: An article, typically the realization of a research paper reporting original research findings, published in a journal issue. [Source: https://sparontologies.github.io/fabio/current/fabio.html#d4e3646] @en
narrower: erratum
preferred label: 学术论文 @zh
preferred label: журнальная статья @ru
preferred label: 학술지 논문 @ko
alternative label: Wissenschaftlicher Artikel @de
preferred label: article de revista @ca
alternative label: papier @fr
alternative label: articolo @it
alternative label: 記事 @ja
alternative label: 期刊論文 @zh
alternative label: 期刊文章 @zh
alternative label: articulo cientifico @es
alternative label: article científic @ca
preferred label: articolo de rivista @it
preferred label: مقال في مجلة أكاديمية @ar
preferred label: article @fr
alternative label: рад у часопису
preferred label: artículo @es
alternative label: article revisat per parells @ca
preferred label: članek v reviji @sl
preferred label: članak u časopisu
alternative label: 紀要論文 @ja
narrow match: D016428
preferred label: 学術雑誌論文 @ja
preferred label: Zeitschriftenaufsatz @de
preferred label: tieteellinen artikkeli @fi
preferred label: artigo @pt
alternative label: artigo em revista @pt
alternative label: 文章 @zh
alternative label: 學術論文 @zh
preferred label: folyóiratcikk @hu
narrower: članak o skupu podataka
preferred label: άρθρο ακαδημαϊκού περιοδικού @el
broad match: Article
preferred label: journal article @en
broader: časopis
alternative label: 论文 @zh
narrower: pregledni članak
type: Concept
preferred label: tidskriftsartikel @sv
alternative label: artigo científico @gl
alternative label: artículo de revista @es
preferred label: článek v odborném časopisu @cs
related match: JournalItem
alternative label: artículo científico @es
preferred label: wetenschappelijk artikel @nl
alternative label: 論文 @zh
narrower: научни чланак
preferred label: стаття у науковому журналі @uk
in scheme: Resource Types
alternative label: 期刊论文 @zh
narrower: чланак о рачунарском програму
related match: SubmittedJournalArticle
preferred label: dergi makalesi @tr

arhivska zbirka
preferred label: arkistokokoelma @fi
alternative label: arhivska kolekcija
preferred label: アーカイブコレクション @ja
preferred label: архівна колекція @uk
preferred label: colecţie arhivală @ro
preferred label: 아카이브 컬렉션 @ko
preferred label: αρχειακή συλλογή @el
alternative label: collection d'archives @fr
preferred label: 档案收藏 @zh
alternative label: fondo arquivístico @gl
preferred label: Archivsammlung @de
alternative label: fons @ca
broader: збирка
preferred label: colección de archivo @es
editorial note: New concept included for version 4 of resource type Vocab @en
definition: A collection of historical records and primary source documents. Documents may be tangible or digital. Adapted from “archive (groupings)” in Getty AAT: https://www.getty.edu/vow/AATFullDisplay?find=maiolica&logic=AND&note=&subjectid=300375748 @en
preferred label: arşiv koleksiyonu @tr
preferred label: archív állomány @hu
preferred label: архивная коллекция @ru
preferred label: archival collection @en
preferred label: colección arquivística @gl
preferred label: fonds d'archives @fr
preferred label: архивска збирка
preferred label: arkivsamling @sv
broad match: Collection
type: Concept
preferred label: acervo arquivístico @pt
preferred label: مجموعة أرشيفية @ar
preferred label: collezione archivistica @it
preferred label: archiefcollectie @nl
alternative label: coleção arquivística @pt
alternative label: fondo @es
in scheme: Resource Types
preferred label: col·lecció d'arxiu @ca
alternative label: archivio @it

меморандум
preferred label: mémo @fr
alternative label: comunicado @es
preferred label: memorandum @en
preferred label: memorando @pt
preferred label: 备忘录 @zh
preferred label: memoràndum @ca
type: Concept
preferred label: notat @da
preferred label: muistio @fi
preferred label: bilgi notu @tr
in scheme: Resource Types
preferred label: μνημόνιο @el
alternative label: Denkschrift @de
alternative label: memòria @ca
alternative label: 備忘錄 @zh
alternative label: razprava @sl
broader: извештај
preferred label: Memorandum @de
alternative label: circular @pt
preferred label: emlékeztető @hu
definition: A formal note distributed internally to one or more persons in a company, agency, organization, or institution, with a header indicating the date it was sent and stating to whom it is addressed (To:), from whom it is sent (From:), and the subject of the text (Re:). Unlike a letter, a memo does not require a full salutation or signature at the end of the text--the sender may simply initial his or her name in the header. [Source: https://products.abc-clio.com/ODLIS/odlis_m.aspx#memorandum] @en
editorial note: Published @en
alternative label: comunicación @es
preferred label: メモランダム @ja
preferred label: memorándum @es
preferred label: مذكرة @ar

master/magistarska teza
preferred label: μεταπτυχιακή διατριβή @el
type: Concept
preferred label: dissertação de mestrado @pt
preferred label: maisterintutkielma @fi
alternative label: specialeafhandling @da
alternative label: trabajo final de master @es
preferred label: أطروحة ماجستير @ar
broad match: Thesis
alternative label: tese de máster @gl
preferred label: yüksek lisans tezi @tr
preferred label: diplomová práce @cs
definition: A thesis reporting a research project undertaken as part of a graduate course of education leading to a master's degree. [Source: https://sparontologies.github.io/fabio/current/fabio.html#d4e4057] @en
preferred label: tesis de maestría @es
alternative label: rapport de master @fr
alternative label: 碩士學位論文 @zh
preferred label: teză de master @ro
preferred label: магістерська робота @uk
preferred label: 硕士学位论文 @zh
preferred label: 修士論文 @ja
preferred label: masterscriptie @nl
alternative label: trabajo final de máster @es
preferred label: tesi di master @it
preferred label: mesterszakos szakdolgozat @hu
alternative label: mémoire de maîtrise @fr
in scheme: Resource Types
alternative label: tesina @ca
preferred label: мастер/магистарска теза
preferred label: traballo de fin de máster @gl
preferred label: master thesis @en
alternative label: treball de fi de postgrau @ca
preferred label: 석사논문 @ko
broader: теза
preferred label: магистерская диссертация @ru
alternative label: trabajo final de posgrado @es
alternative label: 硕士研究生毕业论文 @zh
preferred label: masteruppsats @sv
alternative label: Masterarbeit @de
alternative label: master dissertation @en
preferred label: speciale @da
preferred label: treball final de màster @ca
alternative label: мастер/магистарски рад
alternative label: 碩士研究生畢業論文 @zh
alternative label: master/magistarski rad
alternative label: trabajo final de maestría @es
alternative label: tesis de maestria @es
alternative label: tese de mestrado @pt
alternative label: magistrska naloga @sl
preferred label: magistrsko delo @sl
preferred label: Abschlussarbeit (Master) @de
preferred label: mémoire de master @fr
alternative label: rapport de maîtrise @fr

транскрипт
type: Concept
preferred label: 文字起こし @ja
preferred label: transcription @fr
in scheme: Resource Types
preferred label: transcrição @pt
preferred label: litteroitu teksti @fi
preferred label: transkription @sv
broad match: Text
preferred label: transcripció @ca
preferred label: 전사 @ko
preferred label: транскрипция @ru
preferred label: transkripcija @sl
alternative label: prepis @sl
preferred label: transcriere @ro
preferred label: transcriptie @nl
preferred label: transcrición @gl
alternative label: 誊写记录 @zh
preferred label: trascrizione @it
preferred label: transcripción @es
preferred label: نسخ نصي @ar
preferred label: траскрипт @uk
preferred label: 转录资料 @zh
broader: tekst
preferred label: transkript
definition: A written record of words spoken in court proceedings or in a speech, interview, broadcast, or sound recording. [Source: Adapted from https://products.abc-clio.com/ODLIS/odlis_t.aspx] @en
preferred label: transkripsiyon @tr
preferred label: Transkription @de
preferred label: transzkripció @hu
preferred label: transskription @da
preferred label: μεταγραφή @el

рачунарски програм
preferred label: программное обеспечение @ru
preferred label: software @da
alternative label: programma informatico @it
preferred label: szoftver @hu
alternative label: program @ro
preferred label: logiciel @fr
preferred label: programska oprema @sl
alternative label: софтвер
preferred label: ソフトウェア @ja
alternative label: soft @ro
broad match: Software
preferred label: mjukvara @sv
narrower: softver za nauku
alternative label: programa informático @pt
alternative label: 軟件 @zh
preferred label: ohjelmisto @fi
alternative label: développement informatique @fr
type: Concept
alternative label: 軟體 @zh
alternative label: programa informatico @es
preferred label: برمجيات @ar
preferred label: 软件 @zh
alternative label: počítačový program @cs
top concept of: Resource Types
alternative label: برنامج كمبيوتر @ar
alternative label: program informatic @ro
alternative label: programa de computador @pt
broad match: SoftwareApplication
preferred label: yazılım @tr
alternative label: programa informàtic @ca
preferred label: λογισμικό @el
definition: A computer program in source code (text) or compiled form. [Source: http://purl.org/dc/dcmitype/Software] @en
alternative label: softver
preferred label: računarski program
preferred label: programari @ca
in scheme: Resource Types
preferred label: Software @de
preferred label: 소프트웨어 @ko
alternative label: programme informatique @fr
narrower: изворни софтверски код
alternative label: 软体 @zh

саопштење са конференције
alternative label: comunicación de conferencia @es
preferred label: konferans belgesi @tr
preferred label: comunicación de congreso @es
alternative label: konferenceartikel @da
preferred label: article dans une conférence @fr
alternative label: apresentação em congresso @pt
preferred label: 학술대회 논문 @ko
preferred label: konferenceoplæg @da
alternative label: objavljeno saopštenje sa konferencije
alternative label: documento presentado en una conferencia @es
alternative label: објављено саопштење са конференције
preferred label: άρθρο συνεδρίου @el
preferred label: artikkeli konferenssijulkaisussa @fi
type: Concept
alternative label: článek ve sborníku konference @cs
preferred label: comunicação em conferência @pt
alternative label: artigo de conferência @pt
alternative label: اوراق المؤتمر @ar
alternative label: comunicacion de congreso @es
alternative label: documento presentado en un congreso @es
alternative label: rad sa konferencije
alternative label: presentación de congreso @es
preferred label: ورقة مؤتمر @ar
preferred label: 会议论文 @zh
preferred label: доповідь на конференції @uk
preferred label: kutatási jelentés konferenciaközleményben @hu
alternative label: рад са конференције
preferred label: conferentie paper @nl
alternative label: trabajo presentado en un congreso @es
preferred label: conference paper @en
preferred label: příspěvek na konferenci @cs
preferred label: paper i proceeding @sv
preferred label: comunicació de congrés @ca
alternative label: apresentação em conferência @pt
alternative label: 会议文章 @zh
alternative label: 會議文章 @zh
in scheme: Resource Types
preferred label: articol de conferinţă @ro
alternative label: članek na konferenci @sl
alternative label: konferencepapir @da
alternative label: 會議論文 @zh
alternative label: presentacion de congreso @es
definition: A paper, published within a conference proceeding, typically the realization of a research paper reporting original research findings. [Source: Adapted from https://sparontologies.github.io/fabio/current/fabio.html#d4e2635] @en
preferred label: članek na konfrenci @sl
preferred label: конференционный доклад @ru
preferred label: comunicazione a congresso @it
alternative label: article de congrès @fr
alternative label: trabajo presentado en una conferencia @es
alternative label: comunicação em congresso @pt
preferred label: Konferenzbeitrag @de
broader: zbornik saopštenja sa konferencije
preferred label: 会議発表論文 @ja
alternative label: prispevek na konferenci @sl
alternative label: presentació de congrés @ca
preferred label: saopštenje sa konferencije
alternative label: comunicação @pt
alternative label: comunicacion de conferencia @es
alternative label: article de conférence @fr
alternative label: artigo de congresso @pt
broad match: Event

časopis
preferred label: revista @gl
preferred label: dergi @tr
alternative label: revista académica @pt
alternative label: 学报 @zh
preferred label: rivista @it
alternative label: odborný časopis @cs
preferred label: журнал @ru
in scheme: Resource Types
alternative label: 學報 @zh
preferred label: revista científica @ca
type: Concept
preferred label: 学術雑誌 @ja
alternative label: periódico @pt
preferred label: odborné periodikum @cs
preferred label: revue @fr
alternative label: 科学期刊 @zh
broad match: Text
preferred label: مجلة أكاديمية @ar
definition: A journal is a serial publication devoted to disseminating original research and current developments on a subject. (Adapted from ODLIS) [Source: http://dspacecris.eurocris.org/cris/classcerif/classcerif00422] @en
preferred label: tidsskrift @da
alternative label: научни часопис
preferred label: journal @en
preferred label: tudományos folyóirat @hu
alternative label: دورية علمية @ar
preferred label: wetenschappelijk tijdschrift @nl
broader: tekst
preferred label: науковий журнал @uk
preferred label: Zeitschrift @de
narrow match: JournalArticle
preferred label: tieteellinen kausijulkaisu @fi
preferred label: znanstvena revija @sl
narrower: pismo uredniku
alternative label: naučni časopis
preferred label: часопис
preferred label: 学术期刊 @zh
preferred label: ακαδημαϊκό περιοδικό @el
alternative label: 學術期刊 @zh
alternative label: périodique @fr
preferred label: 학술지 @ko
alternative label: 科學期刊 @zh
narrower: уводник
preferred label: revistă @ro
alternative label: pubblicazione periodica @it
narrower: чланак у часопису
alternative label: 저널 @ko
alternative label: revue scientifique @fr
preferred label: tidskrift @sv

мали патент
preferred label: 実用新案 @ja
broader: patent
preferred label: model de utilitate @ro
preferred label: modelo de utilidade @pt
preferred label: modello di utilità @it
preferred label: használati minta @hu
preferred label: modèle d'utilité @fr
preferred label: نموذج منفعة @ar
preferred label: utility model @en
preferred label: корисна модель @uk
preferred label: modelo de utilidad @es
in scheme: Resource Types
preferred label: Gebrauchsmuster @de
type: Concept
preferred label: hyödyllisyysmalli @fi
preferred label: 实用新型专利 @zh
preferred label: model d'utilitat @ca
preferred label: bruksmodell @sv
definition: A special form of patent right granted by a state or jurisdiction to an inventor or the inventor’s assignee for a fixed period of time. The terms and conditions for granting a utility model are slightly different from those for normal patents (including a shorter term of protection and less stringent patentability requirements). The term can also describe what are known in certain countries as “petty patents,” “short-term patents” or “innovation patents.” [Source: https://www.wipo.int/edocs/pubdocs/en/wipo_pub_943_2018.pdf] @en
preferred label: faydalı model @tr
preferred label: patent s skrajšanim trajanjem @sl
preferred label: mali patent
broad match: d4e4175
preferred label: 실용신안 @ko
preferred label: полезная модель @ru
preferred label: brugsmodel @da
preferred label: gebruiksmodel @nl
preferred label: μοντέλο χρησιμότητας @el

резултат пројекта
preferred label: Ergebnis im Projekt @de
definition: A document containing a project report, intended to be delivered to a customer or funding agency describing the results achieved within a specific project. [Source: https://sparontologies.github.io/fabio/current/fabio.html#d4e5183] @en
alternative label: produto de projeto @pt
preferred label: project deliverable @en
editorial note: Published @en
alternative label: recensão @pt
alternative label: livrable de projet @fr
preferred label: livrable @fr
preferred label: entrega de projecte @ca
broad match: d4e5183
alternative label: livrabilele proiectului @ro
preferred label: entregável de projeto @pt
preferred label: výstup projektu @cs
broad match: Report
preferred label: projectresultaat @nl
preferred label: rezultat projekta
preferred label: результат проекта @ru
preferred label: livrabilul proiectului @ro
type: Concept
preferred label: παραδοτέο έργου @el
preferred label: プロジェクト報告書 @ja
alternative label: memoria de proyecto @es
preferred label: 项目可交付成果 @zh
in scheme: Resource Types
broader: извештај
preferred label: projektrapport @sv
alternative label: resultado de projeto @pt
alternative label: risultato di progetto @it
alternative label: 項目可交付成果 @zh
alternative label: projekt resultat @da
preferred label: entregable de proyecto @es
preferred label: результат проекту @uk
preferred label: proje çıktısı @tr
preferred label: projekteredmény @hu
preferred label: entregable de proxecto @gl
preferred label: deliverable di progetto @it
preferred label: izdelek projekta @sl
alternative label: نتاجات مشروع @ar
alternative label: informes de projectes @ca
preferred label: hankkeen suorite @fi
preferred label: تسليمات مشروع @ar

предлог истраживачког пројекта
preferred label: Exposé @de
preferred label: proposta de investigación @gl
broader: tekst
alternative label: proposta de proxecto @gl
preferred label: kutatási terv @hu
preferred label: 研究計画書 @ja
preferred label: 研究计划 @zh
alternative label: raziskovalna prijava @sl
preferred label: propuesta de recerca @ca
preferred label: дослідницька пропозиція @uk
alternative label: researchProposal @en
preferred label: research proposal @en
alternative label: propuesta de proyecto @es
related match: d4e3400
preferred label: исследовательское предложение @ru
type: Concept
preferred label: predlog istraživačkog projekta
definition: A research proposal is a document proposing a research project, generally in the sciences or academia, and generally constitutes a request for sponsorship of that research. [Source: https://en.wikipedia.org/wiki/Research_proposal] @en
alternative label: proposta di ricerca @it
alternative label: propuesta de projecte @ca
alternative label: propuesta d'investigació @ca
alternative label: 研究計劃 @zh
preferred label: forsknings-forslag @da
broad match: Text
in scheme: Resource Types
preferred label: propuesta de investigación @es
preferred label: مقترح بحثي @ar
preferred label: ερευνητική πρόταση @el
preferred label: predlog raziskave @sl
preferred label: proposta di progetto @it
preferred label: tutkimusehdotus @fi
alternative label: proposta de projeto @pt
alternative label: مقترح بحث @ar
preferred label: onderzoeksvoorstel @nl
alternative label: 研究方案 @zh
preferred label: projet de recherche @fr
alternative label: réponse à appel à projet @fr
preferred label: 연구 계획서 @ko
preferred label: proposta de investigação @pt
preferred label: návrh výzkumného projektu @cs
alternative label: propuesta de investigacion @es
preferred label: propunere de cercetare @ro
preferred label: araştırma önerisi @tr
preferred label: forskningsförslag @sv

геопросторни подаци
preferred label: 地理空间数据 @zh
in scheme: Resource Types
preferred label: dados geoespaciais @pt
preferred label: بيانات جغرافية @ar
preferred label: геопросторові дані @uk
preferred label: Geodaten @de
type: Concept
preferred label: date geospațiale @ro
preferred label: geospatiale data @da
preferred label: geospatiala data @sv
broad match: Dataset
preferred label: dati geospaziali @it
preferred label: геопространственные данные @ru
preferred label: paikkatieto @fi
preferred label: coğrafi uzamsal veri @tr
preferred label: datos xeoespaciais @gl
preferred label: geoprostorski podatki @sl
alternative label: locatie data @nl
related match: D005842
preferred label: geospatial data @en
definition: Geospatial data are any type of data with spatial coordinates that allow them to be mapped to the Earth's surface. They can represent physical objects, discrete areas or continuous surfaces. Discrete geospatial data are usually represented using vector data consisting of points, lines and polygons, while continuous geospatial data are usually represented by raster data, consisting of a grid of cells that each has its own value. Any number of applications in a wide range of areas produce geospatial data, such as GIS, Remote Sensing equipment, GPS units, archaeological total stations, manual mapping and computer-aided design (CAD), in a number of formats, including images, vector, text, and tabular data. Vector-based geospatial data include tables listing archaeological sites along with their coordinates, text-based files (e.g., XML) containing coordinates and topology for historic road networks, voting figures for political parties by administrative area. Raster-based geospatial data include satellite images, aerial photographs, scanned maps, and digital maps of elevations, vegetation, land-use, sea surface temperatures, air pollution, soil-types, etc. [Source: https://ddialliance.org/Specification/DDI-CV/GeneralDataFormat_2.0.html] @en
preferred label: geospatiale gegevens @nl
alternative label: prostorni podaci
preferred label: datos geoespaciales @es
alternative label: jeo uzamsal veri @tr
preferred label: geoprostorni podaci
broader: скуп података
preferred label: dades geoespacials @ca
alternative label: dades geogràfiques @ca
preferred label: donnée géospatiale @fr
related match: SALMON_00000675
preferred label: térinformációs adatok @hu
preferred label: 地理空間データ @ja
preferred label: γεωχωρικά δεδομένα @el
alternative label: просторни подаци
preferred label: 지리공간 데이터 @ko

скуп података
preferred label: tutkimusaineisto @fi
narrower: podaci merenja i ispitivanja
preferred label: veri seti @tr
preferred label: datasæt @da
narrower: genomski podaci
narrower: агрегирани подаци
alternative label: set di dati @it
preferred label: 데이터 세트 @ko
alternative label: dades de recerca @ca
narrower: анкетни подаци
alternative label: grup de dades @ca
preferred label: conxunto de datos @gl
narrower: експериментални подаци
preferred label: skup podataka
alternative label: набор данных @ru
preferred label: σύνολο δεδομένων @el
preferred label: conjuntos de dados @pt
alternative label: 资料组 @zh
alternative label: colecție de date @ro
narrower: snimljeni podaci
preferred label: dataset @sv
narrower: kompilacija podataka
alternative label: tutkimusdata @fi
alternative label: سلسلة بيانات @ar
alternative label: base de dados @pt
preferred label: conjunto de datos @es
type: Concept
alternative label: grupo de datos @gl
preferred label: podatkovni nabor @sl
top concept of: Resource Types
alternative label: série de données @fr
narrower: кодирани подаци
alternative label: zbirka podatkov @sl
preferred label: jeu de données @fr
alternative label: base de datos @es
narrower: симулациони подаци
narrower: podaci prikupljeni posmatranjem
narrower: геопросторни подаци
preferred label: Datensatz @de
preferred label: set de date @ro
narrower: лабораторијске белешке
narrow match: cod.html
definition: A collection of related facts and data encoded in a defined structure. [Source: Adapted from http://purl.org/spar/fabio/Dataset] @en
in scheme: Resource Types
preferred label: datová sada @cs
alternative label: 資料組 @zh
narrower: podaci iz kliničkih ispitivanja
preferred label: 数据集 @zh
alternative label: ensemble de données @fr
preferred label: массив данных @ru
preferred label: набір даних @uk
alternative label: 數據集 @zh
preferred label: データセット @ja
preferred label: adatállomány @hu
related match: cod
preferred label: conjunt de dades @ca
preferred label: مجموعة بيانات @ar

diplomski rad
preferred label: бакалаврская диссертация @ru
in scheme: Resource Types
preferred label: bacheloropgave @da
preferred label: kandidatuppsats @sv
alternative label: trabajo de fin de carrera @es
preferred label: lisans tezi @tr
preferred label: 학사논문 @ko
alternative label: rapport de stage @fr
alternative label: bachelor dissertation @en
preferred label: Abschlussarbeit (Bachelor) @de
alternative label: tesina @es
alternative label: alapszakos szakdolgozat @hu
preferred label: tesi di laurea @it
preferred label: 学士論文 @ja
preferred label: бакалаврська робота @uk
alternative label: monografia de licenciatura @pt
alternative label: 學士學位論文 @zh
alternative label: trabajo final de grado @es
broader: теза
alternative label: πτυχιακή εργασία @el
preferred label: traballo de fin de grao @gl
preferred label: أطروحة بكالوريوس @ar
preferred label: trabalho de fim de curso @pt
alternative label: projecte final de carrera @ca
preferred label: diplomsko delo @sl
preferred label: teză de licență @ro
preferred label: mémoire de stage @fr
preferred label: bachelorscriptie @nl
alternative label: trabalho de fim de licenciatura @pt
alternative label: 本科毕业论文 @zh
preferred label: bachelor thesis @en
preferred label: 学士学位论文 @zh
alternative label: 本科畢業論文 @zh
alternative label: tesis de licenciatura @es
alternative label: monografia de fim de curso @pt
alternative label: proxecto de fin de carreira @gl
alternative label: diplomska naloga @sl
alternative label: tesis de bachiller @es
preferred label: proyecto fin de carrera @es
preferred label: bakalářská práce @cs
alternative label: Bachelorarbeit @de
type: Concept
broad match: Thesis
preferred label: treball de fi de grau @ca
preferred label: kandidaatin tutkielma @fi
preferred label: дипломски рад
definition: A thesis reporting a research project undertaken as part of an undergraduate course of education leading to a bachelor's degree. [Source: https://sparontologies.github.io/fabio/current/fabio.html#d4e2181] @en

план управљања подацима
in scheme: Resource Types
preferred label: načrt ravnanja s podatki @sl
broader: извештај
preferred label: 데이터관리계획 @ko
preferred label: plan de gestión de datos @es
preferred label: data management plan @nl
preferred label: σχέδιο διαχείρισης δεδομένων @el
preferred label: plan de xestión de datos @gl
editorial note: Published @en
preferred label: piano di gestione dei dati @it
preferred label: plan de gestion de données @fr
alternative label: načrt upravljanja s podatki @sl
preferred label: pla de gestió de dades @ca
preferred label: plano de gestão de dados @pt
preferred label: план управления данными @ru
preferred label: veri yönetim planı @tr
alternative label: datahåndteringsplan @da
preferred label: plan de gestionare a datelor @ro
preferred label: план управління даними @uk
definition: A formal statement describing how research data will be managed and documented throughout a research project and the terms regarding the subsequent deposit of the data with a data repository for long-term management and preservation. [Source: https://casrai.org/rdm-glossary] @en
preferred label: plan upravljanja podacima
alternative label: pla d’administració de dades @ca
type: Concept
preferred label: Datenmanagementplan @de
preferred label: datahanteringsplan @sv
preferred label: adatkezelési terv @hu
broad match: OutputManagementPlan
preferred label: datanhallintasuunnitelma @fi
preferred label: خطة إدارة البيانات @ar
preferred label: データ管理計画 @ja
preferred label: 数据管理计划 @zh

библиографија
preferred label: bibliografi @sv
preferred label: bibliographie @fr
preferred label: 文献目录 @zh
preferred label: βιβλιογραφία @el
preferred label: bibliografija
alternative label: 文獻目錄 @zh
narrow match: D016417
preferred label: kaynakça @tr
preferred label: Literaturverzeichnis @de
broader: tekst
alternative label: 书目 @zh
preferred label: bibliografia @fi
definition: A list of the books and articles that have been used by someone when writing a particular book or article [Source: https://dictionary.cambridge.org/dictionary/english/bibliography] @en
preferred label: bibliografie @cs
preferred label: библиография @ru
preferred label: bibliografía @es
alternative label: přehled literatury @cs
broad match: Text
alternative label: bibliyografya @tr
preferred label: 서지 @ko
type: Concept
alternative label: 書目 @zh
preferred label: bibliográfia @hu
preferred label: bibliography @en
preferred label: бібліографія @uk
in scheme: Resource Types
alternative label: Bibliografie @de
preferred label: قائمة مراجع @ar
related match: d4e2195
preferred label: 書誌 @ja

друге врсте извештаја
preferred label: altro tipo di rapporto @it
preferred label: rapport overig @nl
preferred label: ostale vrste poročil @sl
alternative label: 其它報告 @zh
top concept of: Resource Types
preferred label: jiná zpráva @cs
definition: Other types of report may include Business Plans Technical Specifications, data management plans, recommendation reports, white papers, annual reports, auditor's reports, workplace reports, census reports, trip reports, progress reports, investigative reports, budget reports, policy reports, demographic reports, credit reports, appraisal reports, inspection reports, military reports, bound reports, etc. [Source: https://en.wikipedia.org/wiki/Report] @en
preferred label: druge vrste izveštaja
preferred label: sonstiger Report @de
in scheme: Resource Types
type: Concept
preferred label: نوع آخر من التقرير @ar
alternative label: outro tipo de relatório @pt
alternative label: otro tipo de reporte @es
alternative label: guideline @en
expires: 2021-03-12
preferred label: diğer rapor türü @tr
preferred label: otro tipo de informe @es
preferred label: 其他报告 @zh
alternative label: laboratory material @en
preferred label: other type of report @en
editorial note: Deprecated @en
preferred label: autre type de rapport @fr
alternative label: ander type rapport @nl
preferred label: その他の報告書 @ja
preferred label: altre tipus d'informe @ca
preferred label: outro relatório @pt

научни чланак
in scheme: Resource Types
preferred label: araştırma makalesi @tr
alternative label: originalni naučni rad
alternative label: artigo de investigação @pt
broad match: Article
alternative label: оригинални научни рад
preferred label: ερευνητικό άρθρο @el
alternative label: artículo científico @es
alternative label: 연구 논문 @ko
preferred label: artículo original @es
preferred label: onderzoeksartikel @nl
preferred label: article de recerca @ca
alternative label: artigo científico @pt
preferred label: tutkimusartikkeli @fi
alternative label: مقالة بحثية @ar
alternative label: article scientifique @fr
alternative label: articulo original @es
preferred label: articol de cercetare @ro
alternative label: исследовательская статья @ru
preferred label: research article @en
preferred label: наукова стаття @uk
preferred label: forskningsartikel @da
editorial note: Published @en
preferred label: 원저 논문 @ko
preferred label: artigo original @pt
preferred label: مقال بحثي @ar
definition: A research article is a primary source, that is, it reports the methods and results of an original study performed by the authors. (adapted from http://apus.libanswers.com/faq/2324) @en
alternative label: articulo cientifico @es
alternative label: article científic @ca
preferred label: znanstveni članek @sl
preferred label: Forschungsartikel @de
alternative label: originalni naučni članak
preferred label: научная статья @ru
alternative label: 原创研究论文 @zh
preferred label: szakcikk @hu
alternative label: artículo de investigación @es
alternative label: оригинални научни чланак
alternative label: публикация в научном журнале @ru
preferred label: původní článek @cs
type: Concept
preferred label: article de recherche @fr
broader: чланак у часопису
preferred label: artigo de investigación @gl
preferred label: naučni članak
preferred label: 原著論文 @ja
alternative label: articulo de investigacion @es
preferred label: 原创研究文章 @zh

pismo uredniku
preferred label: carta ao editor @pt
preferred label: 편집자에게 보내는 편지 @ko
preferred label: ingezonden brief @nl
preferred label: lettera al direttore @it
alternative label: gaceta @es
preferred label: kirje päätoimittajalle @fi
alternative label: boletín @fr
alternative label: 快报 @zh
preferred label: 读者来信 @zh
preferred label: επιστολή προς τον εκδότη @el
preferred label: лист до редакції @uk
preferred label: carta al director @es
preferred label: brev til redaktøren @da
alternative label: gacetilla @es
preferred label: dopis redakci @cs
preferred label: писмо уреднику
alternative label: 讀者來信 @zh
alternative label: carta ao diretor @pt
preferred label: رسالة الى المحرر @ar
preferred label: carta ao director @gl
alternative label: comunicazione in rivista @it
alternative label: carta al director de revista @es
preferred label: levél a szerkesztőnek @hu
preferred label: editöre mektup @tr
alternative label: 快報 @zh
alternative label: folleto @es
alternative label: pismo redakciji
broader: časopis
preferred label: 来信 @ja
preferred label: letter to the editor @en
preferred label: lettre à l'éditeur @fr
alternative label: carta al editor @es
broad match: d4e3803
type: Concept
alternative label: писмо редакцији
definition: A letter addressed to the editor and comments on or discussed an item previously published by that periodical, or of interest to its readership. [Source: Adapted from hhttps://sparontologies.github.io/fabio/current/fabio.html#d4e3803] @en
alternative label: boletin @fr
preferred label: scrisoare către editor @ro
preferred label: письмо редактору @ru
alternative label: писмо уредништву
preferred label: Leserbrief @de
alternative label: carta al editor de revista @es
alternative label: inledande text i tidskrift @sv
alternative label: pismo uredništvu
in scheme: Resource Types

mapa
alternative label: отображение @ru
preferred label: landkort @da
definition: harita @tr
preferred label: карта @ru
preferred label: karta @sv
preferred label: harita @tr
alternative label: план @ru
preferred label: zemljevid @sl
preferred label: χάρτης @el
preferred label: kaart @nl
alternative label: географска карта
preferred label: hartă @ro
preferred label: térkép @hu
preferred label: خارطة @ar
preferred label: 地图 @zh
alternative label: plan @fr
definition: Defined as a representation normally to scale and on a flat medium, of a selection of material or abstract features on, or in relation to, the surface of the earth or of another celestial body. [Source: https://www.loc.gov/marc/bibliographic/bd007a.html] @en
editorial note: Published @en
preferred label: carte géographique @fr
alternative label: geografska karta
preferred label: mappa @it
preferred label: мапа
alternative label: 地圖 @zh
alternative label: kort @da
broader: kartografska građa
type: Concept
preferred label: 지도 @ko
in scheme: Resource Types
preferred label: Karte @de
preferred label: 地図 @ja
preferred label: map @en
preferred label: kartta @fi
alternative label: landskabskort @da
alternative label: чертёж @ru

поглавље у књизи
preferred label: Teil eines Buches @de
preferred label: часть книги @ru
alternative label: поглавље у монографији
alternative label: kapitola v knize @cs
preferred label: 도서(부분) @ko
alternative label: 章節 @zh
preferred label: poglavje v knjigi @sl
preferred label: μέρος του βιβλίου @el
alternative label: Buchkapitel @de
preferred label: bokkapitel @sv
alternative label: partie d'ouvrage @fr
alternative label: capítulo @pt
alternative label: paragrafo @it
type: Concept
preferred label: bogsektion @da
alternative label: sestavek v knjigi @sl
preferred label: capítol de llibre @ca
alternative label: bog kapitel @da
preferred label: könyvrészlet @hu
preferred label: capítulo de libro @es
alternative label: poglavlje u monografiji
preferred label: 章节 @zh
preferred label: 図書（部分） @ja
in scheme: Resource Types
alternative label: chapitre de livre @fr
broader: knjiga
alternative label: فصل من كتاب @ar
preferred label: розділ книги @uk
preferred label: capitol de carte @ro
preferred label: capitolo di libro @it
preferred label: capítulo de livro @pt
alternative label: parte de libro @es
alternative label: parte de um livro @pt
preferred label: boekdeel @nl
broad match: Book
alternative label: part de llibre @ca
alternative label: capitulo de libro @es
preferred label: chapitre d'ouvrage @fr
preferred label: poglavlje u knjizi
definition: A defined chapter or section of a book, usually with a separate title or number. [Source: http://purl.org/spar/fabio/BookChapter] @en
preferred label: جزء من كتاب @ar
preferred label: book part @en
preferred label: kirjan osa @fi
preferred label: část knihy @cs
preferred label: kitap bölümü @tr

анкетни подаци
preferred label: δεδομένα έρευνας @el
preferred label: haastatteluaineisto @fi
preferred label: date de sondaj @ro
alternative label: onderzoeksgegevens @nl
preferred label: undersökningsdata @sv
preferred label: datos de encuesta @es
preferred label: dades d'enquestes @ca
preferred label: بيانات مسحية @ar
broader: скуп података
preferred label: Umfragedaten @de
type: Concept
preferred label: 설문조사 데이터 @ko
preferred label: dados de inquéritos @pt
alternative label: date din sondaj @ro
preferred label: dati di indagine @it
preferred label: anketni podaci
preferred label: данные опроса @ru
preferred label: datos de enquisa @gl
preferred label: anketni podatki @sl
alternative label: données de sondage @fr
preferred label: 调查数据 @zh
alternative label: dades topogràfiques @ca
preferred label: undersøgelsesdata @da
broad match: Dataset
in scheme: Resource Types
preferred label: survey data @en
preferred label: felmérési adatok @hu
preferred label: donnée d'enquête @fr
preferred label: 調査データ @ja
definition: Data resulting from a survey, which is defined as an investigation about the characteristics of a given population by means of collecting data from a sample of that population and estimating their characteristics through the systematic use of statistical methodology. Included are censuses, sample surveys, the collection of data from administrative records and derived statistical activities as well as questionnaires. [Source: Adapted from https://stats.oecd.org/glossary/detail.asp?ID=2620] @en
alternative label: survey-aineisto @fi
preferred label: anket verisi @tr
preferred label: onderzoeksdata @nl
preferred label: дані опитування @uk

информативна ревија
alternative label: revista de divulgación @es
preferred label: revista de divulgação @pt
preferred label: tijdschrift @nl
preferred label: Magazin @de
preferred label: aikakauslehti @fi
broader: tekst
editorial note: Published @en
alternative label: časopis @sl
narrower: članak u informativnoj reviji
preferred label: magazine @en
preferred label: informativna revija
preferred label: revista divulgativa @gl
preferred label: magasin @da
preferred label: revista de divulgació @ca
preferred label: 잡지 @ko
alternative label: revista de divulgacion cientifica @es
preferred label: 杂志 @zh
preferred label: rivista divulgativa @it
alternative label: revista de divulgación científica @es
alternative label: revista de divulgacion @es
alternative label: časnik @sl
type: Concept
definition: A popular interest periodical usually containing articles on a variety of topics, written by various authors in a nonscholarly style or a trade publication, unlike a consumer publication, covers a specific topic for people who work in that particular field or industry. [Source: Adapted from https://www.thebalance.com/what-is-a-trade-publication-exactly-2316039 and http://www.abc-clio.com/ODLIS/odlis_m.aspx] @en
preferred label: периодическое печатное издание @ru
preferred label: magazin
preferred label: 雑誌 @ja
in scheme: Resource Types
alternative label: Informationszeitschrift @de
preferred label: مجلة @ar
alternative label: revista informativa @pt
alternative label: магазин
preferred label: журнал @uk

komentar
broad match: d4e2568
preferred label: comentariu @ro
preferred label: comentario @gl
preferred label: 論評 @ja
type: Concept
alternative label: değerlendirme @tr
preferred label: kritiikki @fi
alternative label: comentari @ca
in scheme: Resource Types
preferred label: yorum @tr
definition: A commentary is a more in-depth analysis written to draw attention to a work already published. Commentaries are somewhat like “reviews” in that the author presents his or her analysis of a work and why it would be of interest to a specific audience. [Source: https://www.enago.com/academy/perspective-opinion-and-commentary-pieces] @en
preferred label: comentário @pl
preferred label: 评注 @zh
preferred label: commentary @en
preferred label: kommentar @sv
preferred label: commentario @it
preferred label: коментар
preferred label: opinió @ca
preferred label: комментарий @ru
preferred label: commentaire @fr
preferred label: σχολιασμός @el
preferred label: commentaar @nl
preferred label: تعليق @ar
preferred label: kommentár @hu
preferred label: 논평 @ko
broader: приказ
preferred label: Kommentar @de

versión enviada
alternative label: prepublicación @es
preferred label: preprint
alternative label: voordruk @nl
type: Concept
alternative label: borrador @es
alternative label: articulo sin revision por pares @es
preferred label: articolo preliminare @it
preferred label: pre-tipărire @ro
preferred label: 预印本 @zh
preferred label: προεκτύπωση @el
definition: A preprint is a scientific manuscript without peer-review and has not yet been accepted by a journal, typicaly submitted to a public server/ repository by the author. [Source: Adapted from https://asapbio.org/preprint-info/preprint-faq#qaef-637] @en
broad match: Text
preferred label: Preprint @de
preferred label: ön baskı @tr
preferred label: artículo preliminar @es
alternative label: artigo sem revisão @pt
alternative label: articulo preliminar @es
preferred label: プレプリント @ja
in scheme: Resource Types
preferred label: طبعة أولية @ar
preferred label: publicació preliminar @ca
editorial note: Deprecated @en
preferred label: препринт
alternative label: Vorabdruck @de
alternative label: préprint @fr
preferred label: prépublication @fr
alternative label: 先印本 @zh
alternative label: artigo preliminar @pt
alternative label: artículo sin revisión por pares @es
broader: tekst

Resource Types
has top concept: наставни материјал
has top concept: istraživački instrument
has top concept: заштитни знак
has top concept: Interview
has top concept: скуп података
modified: 2025-06-09T18:52:19+00:00
has top concept: periodična publikacija
has top concept: уметничко дело
has top concept: fizički uzorak
has top concept: chapitre de rapport
has top concept: радни процес
has top concept: слика
has top concept: рачунарски програм
has top concept: report to funding agency
has top concept: kartografska građa
has top concept: zvučni zapis
type: ConceptScheme
has top concept: систем организације знања
has top concept: ostalo
has top concept: informativni prilog
has top concept: interni izveštaj
has top concept: research data
has top concept: tekst
has top concept: дизајн
has top concept: patent
has top concept: збирка
has top concept: друге врсте извештаја
has top concept: interaktivna građa
description: The Resource Type vocabulary defines concepts to identify the genre of a resource. Such resources, like publications, research data, audio and video objects, are typically deposited in institutional and thematic repositories or published in ejournals. This vocabulary supports a hierarchical model that relates narrower and broader concepts. Multilingual labels regard regional distinctions in language and term. Concepts of this vocabulary are mapped with terms and concepts of similar vocabularies and dictionaries.
creator: Isabel Bernal, CSIC, Spain (Editorial Board Chair)
creator: Joseph Cera, University of California-Berkeley, US
creator: Mick Eadie, University of Glasgow, United Kingdom
creator: Benedetta Gandolini, 4Science, Italy
creator: Sebastiano Giorgi, UOC, Spain
creator: Gültekin Gürdal, Izmir Institute of Technology Library, Turkey
creator: Tomoko Kataoka, JPCOAR, Japan
creator: Pierre Lasou, Université Laval, Canada
creator: Yoo Young Lee, University of Ottawa, Canada
creator: Ku (Alan) Liping, Chinese Academy of Science
creator: Katharina Menhard, Technische Universität Graz, Austria
creator: Gretchen Neidhardt, Northwestern University, United States
creator: Milan Ojsteršek, University of Maribor, Slovenia
creator: Pedro Príncipe, Universidade do Minho, Portugal
creator: Ellen Ramsey, COAR
creator: Jochen Schirrwagen, Aachen University, Germany
creator: Corinna Schneider, Technische Informationsbibliothek (TIB), Germany
creator: Milica Sevkusic, EIFL Serbia
creator: Kathleen Shearer, COAR
contributor: Barbara Aristidou, Cyprus University of Technology, Cyprus
contributor: Rawia Awadallah, Arab States Research and Education Network
contributor: Aysen Binen, Izmir Institute of Technology, Turkey
contributor: Jessica Byström, Chalmers University, Sweden
contributor: Julie Gauthier, University of Montreal, Canada
contributor: Diana Furcila Mihalache, FECYT, Spain
contributor: Hyekyong Hwang, KISTI, Korea
contributor: Krisztina Korosi, University Library of Corvinus University of Budapest, Hungary
contributor: Iryna Kuchma, EIFL, Ukraine
contributor: Christian Lacroix, University of Montreal, Canada
contributor: Petra Magnusson, Chalmers University, Sweden
contributor: George Macgregor, University of Glasgow, UK
contributor: Antonia Nicolaou, Cyprus University of Technology, Cyprus
contributor: Jussi Piipponnen, Finnish National Library Group, Finland
contributor: Carmen Posse, University Library of Santiago de Compostela, Spain
contributor: Irina Razumova, COAR
contributor: Sa-kwang Song, KISTI, Korea
contributor: Wilko Steinhoff, DANS, The Netherlands
contributor: Paul Walk, Antleaf, UK

zaštićena biljna sorta
preferred label: protecția soiurilor de plante @ro
preferred label: Sortenschutz @de
alternative label: obtenció de les varietats vegetals @ca
preferred label: 育成者権 @ja
preferred label: protección de variedades vexetais @gl
preferred label: plante nyheds beskyttelses @da
preferred label: obtención de variedades vegetales @es
preferred label: προστασία φυτικών ποικιλιών @el
in scheme: Resource Types
definition: Plant variety protection, also called a "plant breeder's right" (PBR), is a form of intellectual property right granted to the breeder of a new plant variety . According to this right, certain acts concerning the exploitation of the protected variety require the prior authorization of the breeder. Plant variety protection is an independent sui generis form of protection, tailored to protect new plant varieties and has certain features in common with other intellectual property rights. [Source: https://www.wipo.int/edocs/pubdocs/en/wipo_pub_943_2018.pdf] @en
preferred label: žlahniteljska pravica @sl
alternative label: Pflanzensortenschutz @de
preferred label: 植物新品种保护 @zh
preferred label: 식물품종보호권 @ko
alternative label: COB @fr
preferred label: növényfajta-oltalom @hu
preferred label: växtförädlarrätt @sv
preferred label: privativa di varietà vegetale @it
preferred label: охрана новых сортов растений @ru
preferred label: protecció de les varietats vegetals @ca
preferred label: plant variety protection @en
broader: patent
preferred label: حماية الأصناف النباتية @ar
preferred label: plantenras bescherming @nl
preferred label: заштићена биљна сорта
preferred label: kasvinjalostajanoikeus @fi
preferred label: bitki çeşitliliğini koruma @tr
preferred label: certificat d'obtention végétale @fr
preferred label: захист сортів рослин @uk
preferred label: proteção de variedades vegetais @pt
type: Concept

πρωτόκολλο σύνθεσης γνώσης
preferred label: protocolo de síntese do coñecemento @gl
preferred label: knowledge synthesis protocol @en
alternative label: plan de síntesis del conocimiento @es
preferred label: prokoll vid systematisk översikt @sv
in scheme: Resource Types
definition: In the context of systematic reviews and meta-analyses, a protocol is a document that presents an explicit plan for a systematic review. The protocol details the rationale and a priori methodological and analytical approach of the review. https://www.bmj.com/content/349/bmj.g7647 @en
preferred label: Wissenssyntheseprotokoll @de
broader: извештај
preferred label: systematisk protokol @da
preferred label: bilgi sentezi protokolü @tr
broad match: http://purl.bioontology.org/ontology/MESH/D000078182
alternative label: protocol de evaluare a cunostințelor @ro
preferred label: protocolo de síntesis del conocimiento @es
preferred label: протокол синтезу знань @uk
editorial note: New concept included t be added to upcoming version 4.0 @en
alternative label: načrt raziskave @sl
preferred label: 知識統合プロトコル @ja
preferred label: protocole de synthèse @fr
preferred label: protocol de sinteză a cunostințelor @ro
preferred label: بروتوكول توليف المعرفة @ar
preferred label: systemaattisen katsauksen protokolla @fi
preferred label: kennissynthese protocol @nl
preferred label: szakirodalom áttekintési protokoll @hu
preferred label: 지식통합 프로토콜 @ko
alternative label: protokol za sintezo znanja @sl
preferred label: 知识综合协议 @zh
alternative label: plan de síntese do coñecemento @gl
broad match: d4e5605
alternative label: metodologija sinteze znanja @sl
preferred label: protocollo di sintesi @it
preferred label: protocol de síntesi del coneixement @ca
preferred label: metodologija raziskave @sl
type: Concept
preferred label: protocolo de síntese de conhecimentos @pt
preferred label: протокол синтеза знаний @ru

изворни софтверски код
preferred label: izvorna koda @sl
preferred label: source code @en
alternative label: الشفرة المصدرية @ar
preferred label: izvorni softverski kod
preferred label: cod sursă @ro
preferred label: вихідний код @uk
preferred label: كود المصدر @ar
preferred label: πηγαίος κώδικας @el
preferred label: kildekode @da
preferred label: Quellcode @de
preferred label: forráskód @hu
preferred label: ソースコード @ja
preferred label: kaynak kodu @tr
preferred label: lähdekoodi @fi
preferred label: källkod @sv
preferred label: code source @fr
definition: Source code is any collection of code, with or without comments, written using a human-readable programming language, usually as plain text. [Source: https://en.wikipedia.org/wiki/Source_code] @en
preferred label: codi font @ca
preferred label: codice sorgente @it
preferred label: 소스 코드 @ko
preferred label: código fonte @gl
alternative label: softwarekode @da
preferred label: исходный код @ru
type: Concept
preferred label: broncode @nl
preferred label: 源代码 @zh
in scheme: Resource Types
broader: рачунарски програм
preferred label: código fuente @es
alternative label: brontekst @nl

уводник
preferred label: εκδοτικό σημείωμα @el
preferred label: редакционная @ru
preferred label: szerkesztői cikk @hu
preferred label: voorwoord @nl
alternative label: editorial de revista @pt
preferred label: Editoryal @tr
alternative label: 社评 @zh
preferred label: editorial @en
alternative label: tribuna de opinión @es
preferred label: uvodnik
preferred label: редакційна стаття @uk
preferred label: Vorwort @de
alternative label: artículo de fondo @es
preferred label: úvodník @cs
preferred label: 에디토리얼 @ko
definition: A brief essay expressing the opinion or position of the chief editor(s) of a (academic) journal with respect to a current political, social, cultural, or professional issue. [Source: Adapted from ODLIS [Source: http://www.abc-clio.com/ODLIS/odlis_e.aspx ] @en
preferred label: redaktionel @da
alternative label: presentació @ca
broader: časopis
alternative label: reč urednika
preferred label: エディトリアル @ja
type: Concept
alternative label: Leitartikel @de
alternative label: 社評 @zh
narrow match: D016421
preferred label: editoriale @it
related match: D016420
in scheme: Resource Types
alternative label: inledande text i tidskrift @sv
preferred label: افتتاحية @ar
alternative label: 社論 @zh
preferred label: 社论 @zh
preferred label: pääkirjoitus @fi
alternative label: édito @fr
alternative label: реч уредника
preferred label: éditorial @fr

ostalo
preferred label: diğer @tr
alternative label: άλλα @el
preferred label: 기타 @ko
in scheme: Resource Types
preferred label: altro @it
alternative label: غير ذلك @ar
preferred label: muu @fi
preferred label: outros @pt
alternative label: altul @ro
preferred label: інше @uk
definition: A resource type that is not included in existing terms. [COAR definition] @en
preferred label: остало
preferred label: autre @fr
preferred label: 其他 @zh
preferred label: egyéb @hu
preferred label: άλλο @el
preferred label: andre @da
preferred label: آخر @ar
preferred label: ostatní @cs
preferred label: övrigt @sv
alternative label: altele @ro
preferred label: anders @nl
preferred label: другое @ru
top concept of: Resource Types
preferred label: other @en
alternative label: 其它 @zh
type: Concept
preferred label: sonstige @de
preferred label: otros @es
preferred label: alte @ro
preferred label: その他 @ja
preferred label: altres @ca

збирка
preferred label: مجموعة @ar
in scheme: Resource Types
top concept of: Resource Types
narrower: arhivska zbirka
preferred label: koleksiyon @tr
definition: An aggregation of resources, which may encompass collections of one resourceType as well as those of mixed types. A collection is described as a group; its parts may also be separately described. https://datacite-metadata-schema.readthedocs.io/en/4.5/appendices/appendix-1/resourceTypeGeneral/#collection @en
type: Concept
preferred label: коллекция @ru
editorial note: New concept included for version 4 of Resource types Vocab @en
preferred label: gyűjtemény @hu
preferred label: zbirka
preferred label: 컬렉션 @ko
alternative label: repertorio @gl
preferred label: συλλογή @el
preferred label: colección @es
alternative label: acervo @pt
preferred label: kolekcija
preferred label: collectie @nl
preferred label: col·lecció @ca
preferred label: collection @en
alternative label: собрание @ru
preferred label: колекція @uk
preferred label: colecție @ro
preferred label: コレクション @ja
preferred label: collezione @it
preferred label: samling @da
preferred label: kokoelma @fi
narrower: documente judiciare
alternative label: колекција
preferred label: coleção @pt
preferred label: Sammlung @de
preferred label: 收藏品 @zh

neobjavljen poster sa konferencije
preferred label: poster @sl
related match: ConferenceProceeding
preferred label: konferensposter ej i proceeding @sv
preferred label: ملصق مؤتمر ليس ضمن وقائع المؤتمر @ar
preferred label: poster de conferinţă nepublicat @ro
preferred label: konferenční poster nezahrnutý ve sborníku @cs
preferred label: konference plakat ikke i konferencehandlinger @da
preferred label: poster dans une conférence non publié dans les actes @fr
preferred label: yayınlanmamış konferans posteri @tr
preferred label: αφίσα συνεδρίου που δε δημοσιεύτηκε στα πρακτικά @el
alternative label: póster não publicado nas atas do congresso @pt
preferred label: póster não publicado nas atas da conferência @pt
alternative label: plakat @sl
broader: konferencijski prilog
preferred label: 미게재 학술대회 포스터 @ko
preferred label: стендова доповідь яка не увійшла до збірника @uk
preferred label: póster de congreso non publicado nas actas @gl
preferred label: стендовый доклад не включенный в материалы конференции @ru
preferred label: Konferenzposter nicht im Tagungsband @de
alternative label: 未發表在會議論文集中的海報 @zh
preferred label: conferentie poster niet in proceedings @nl
definition: A display poster, typically containing text with illustrative figures and/or tables, usually reporting research results or proposing hypotheses, submitted for acceptance to and/or presented at a conference, seminar, symposium, workshop or similar event. Use this label when the poster is not published in a proceeding. [Source: http://purl.org/spar/fabio/ConferencePoster] @en
preferred label: pòster de congrés no publicat @ca
preferred label: conference poster not in proceedings @en
alternative label: konference poster ikke i konferencehandlinger @da
preferred label: 会議発表ポスター（会議録未掲載） @ja
preferred label: posteri erillisjulkaisuna @fi
preferred label: poster non pubblicato in atti di congresso @it
type: Concept
preferred label: konferenciaköteten kívüli poszter @hu
editorial note: Proposed deprecated @en
in scheme: Resource Types
alternative label: poster de conférence non publié dans les actes @fr
preferred label: 非会议集里的会议海报/会议板报 @zh
preferred label: póster no publicado en actas de congreso @es
preferred label: необјављен постер са конференције

техничка документација
type: Concept
preferred label: технічна документація @uk
preferred label: technical documentation @en
alternative label: documentation technique @fr
preferred label: documentación técnica @es
preferred label: manuel technique @fr
alternative label: 技术文献 @zh
preferred label: technická dokumentace @cs
in scheme: Resource Types
preferred label: 技术资料 @zh
alternative label: 技術文獻 @zh
broad match: Text
preferred label: műszaki dokumentáció @hu
preferred label: tekninen dokumentaatio @fi
preferred label: 기술문서 @ko
alternative label: documentacion tecnica @es
preferred label: teknik dokümantasyon @tr
alternative label: 技术文档 @zh
preferred label: τεχνική τεκμηρίωση @el
preferred label: teknisk dokumentation @da
alternative label: manual @es
alternative label: manual técnico @pt
preferred label: 技術文書 @ja
preferred label: техническая документация @ru
preferred label: documentação técnica @pt
preferred label: documentazione tecnica @it
preferred label: tehnička dokumentacija
alternative label: Technische Unterlagen @de
preferred label: وثائق فنية @ar
preferred label: documentació tècnica @ca
alternative label: 技術資料 @zh
preferred label: technische documentatie @nl
broad match: Document
alternative label: manuale tecnico @it
broader: tekst
alternative label: 技術文檔 @zh
alternative label: وثائق تقنية @ar
preferred label: tehnična dokumentacija @sl
preferred label: Technische Dokumentation @de
preferred label: documentație tehnică @ro
definition: Technical documentation refers to any type of documentation that describes handling, functionality and architecture of a technical product or a product under development or use. [Source: https://en.wikipedia.org/wiki/Technical_documentation] @en

дизајн
preferred label: suunnitelma @fi
definition: Plans, drawing or set of drawings showing how something e.g. building, product is to be made and how it will work and look. [Source: Adapted from https://dictionary.cambridge.org/dictionary/english/design] @en
preferred label: desenho @pt
preferred label: дизайн @uk
preferred label: deseño @gl
narrower: shema konfiguracije
narrower: индустријски дизајн
preferred label: design @sv
in scheme: Resource Types
preferred label: σχεδίαση @el
preferred label: 设计 @zh
preferred label: tasarım @tr
preferred label: 디자인 @ko
preferred label: oblikovanje @sl
preferred label: Entwurf @de
preferred label: disseny @ca
preferred label: デザイン @ja
preferred label: تصميم @ar
preferred label: schéma @fr
preferred label: dizajn
preferred label: ontwerp @nl
preferred label: formgivning @da
top concept of: Resource Types
preferred label: diseño @es
type: Concept
preferred label: tervrajz @hu
preferred label: proiectare @ro

заштитни знак
preferred label: εμπορικό σήμα @el
preferred label: zaštitni znak
preferred label: handelsmerk @nl
preferred label: Warenzeichen @de
preferred label: торговая марка @ru
in scheme: Resource Types
preferred label: márka @hu
preferred label: ticari marka @tr
preferred label: marca @gl
preferred label: logo @ca
preferred label: 商标 @zh
definition: A sign used to distinguish the goods or services of one undertaking from those of others. A trademark may consist of words and combinations of words (for instance, names or slogans), logos, figures and images, letters, numbers, sounds, or, in rare instances, smells or moving images, or a combination thereof. [Source: https://www.wipo.int/trademarks/en] @en
alternative label: logosímbol @ca
preferred label: 상표 @ko
preferred label: trademark @en
related match: D010330
preferred label: tavaramerkki @fi
top concept of: Resource Types
preferred label: varumärke @sv
preferred label: blagovna znamka @sl
preferred label: торгова марка @uk
preferred label: 商標 @ja
alternative label: marca registada @pt
preferred label: علامة تجارية @ar
preferred label: marcă @ro
type: Concept
alternative label: marque commerciale @fr
preferred label: marchio depositato @it
preferred label: varemærke @da
alternative label: símbol @ca
preferred label: marque déposée @fr

радни процес
preferred label: flujo de trabajo @es
alternative label: flux de travail @fr
preferred label: flux de travaux @fr
preferred label: pracovní postup @cs
alternative label: cicle de treball @ca
preferred label: 워크플로우 @ko
preferred label: процес роботи @uk
preferred label: arbetslöde @sv
preferred label: flux de lucru @ro
top concept of: Resource Types
preferred label: ροή εργασίας @el
preferred label: flux de treball @ca
preferred label: workflow @en
preferred label: 工作流程 @zh
preferred label: fluxo de traballo @gl
alternative label: flusso di lavoro @it
type: Concept
alternative label: Arbeitsablauf @de
in scheme: Resource Types
preferred label: delovni tok @sl
preferred label: arbejdsgang @da
preferred label: fluxo de trabalho @pt
preferred label: munkafolyamat leírása @hu
definition: A recorded sequence of connected steps, which may be automated, specifying a reliably repeatable sequence of operations to be undertaken when conducting a particular job, for example an in silico investigation that extracts and processes information from a number of bioinformatics databases. [Source: Adapted from https://sparontologies.github.io/fabio/current/fabio.html#d4e6123] @en
preferred label: سير العمل @ar
preferred label: iş akışı @tr
preferred label: työnkulku @fi
preferred label: procedura
alternative label: 工作流 @zh
alternative label: процедура
alternative label: flux opérationnel @fr
preferred label: radni proces
preferred label: рабочий процесс @ru
preferred label: ワークフロー @ja
preferred label: Workflow @de

predavanje
alternative label: disertacion @es
alternative label: conferencia magistral @es
preferred label: 讲座 @zh
preferred label: conferència acadèmica @ca
alternative label: lecție @ro
alternative label: disertación @es
alternative label: classe magistral @ca
alternative label: 講課 @zh
preferred label: διάλεξη @el
alternative label: 講座 @zh
alternative label: discurs @ro
alternative label: conferência @pt
alternative label: lição @pt
type: Concept
alternative label: conferinţă @ro
alternative label: prelecção @pt
alternative label: conferencia académica @es
preferred label: luento @fi
alternative label: 讲课 @zh
preferred label: föreläsning @sv
definition: Transcription of an oral presentation/talk intended to present information or teach people about a particular subject, for example by a university or college teacher. [Source: Adopted from https://en.wikipedia.org/wiki/Lecture] @en
preferred label: cours magistral @fr
alternative label: 演讲 @zh
alternative label: 演講 @zh
preferred label: предавање
alternative label: preleção @pt
preferred label: 講演 @ja
alternative label: conferencia @es
alternative label: charla magistral @es
alternative label: conferencia academica @es
in scheme: Resource Types
alternative label: curs @ro
preferred label: lezione @it
preferred label: 강연 @ko
preferred label: prelegere @ro
preferred label: lecture @en
narrow match: d4e3776
preferred label: ponencia @es
preferred label: foredrag @da
preferred label: лекция @ru
preferred label: előadás átirata @hu
preferred label: přednáška @cs
broader: tekst
preferred label: ders @tr
preferred label: Vorlesung @de
preferred label: palestra @pt
alternative label: enseignement magistral @fr
preferred label: محاضرة @ar
preferred label: лекція @uk
alternative label: lectures @en
preferred label: relatorio @gl

članak u informativnoj reviji
preferred label: magazin makalesi @tr
preferred label: 雑誌記事 @ja
preferred label: magazincikk @hu
preferred label: aikakauslehtiartikkeli @fi
preferred label: article de divulgació @ca
preferred label: časopisni članek @sl
preferred label: magasinartikel @da
broader: информативна ревија
alternative label: articolo scientifico @it
preferred label: articolo in rivista @it
preferred label: tijdschriftartikel @nl
preferred label: Zeitschriftenartikel @de
preferred label: стаття у журналі @uk
preferred label: مقال في مجلة @ar
preferred label: artikel i magasin @sv
alternative label: чланак у магазину
type: Concept
preferred label: artigo em revista @pt
alternative label: članak u magazinu
preferred label: artículo de magacín @es
preferred label: 잡지 기사 @ko
preferred label: чланак у информативној ревији
in scheme: Resource Types
preferred label: article de magazine @fr
preferred label: magazine article @en
definition: An Item appearing in a magazine (a general interest or specific focus periodical). This item is often shorter in length, is submitted by in-house and external authors. Adapted from MAGAZINE Definition & Meaning - Black's Law Dictionary (thelawdictionary.org) @en
preferred label: artigo de revista divulgativa @gl
editorial note: New concept added to be included in upcoming version 4.0 @en

rukopis
in scheme: Resource Types
preferred label: manoscritto @it
alternative label: манускрипт @ru
preferred label: Yazma eser @tr
alternative label: document original @ca
alternative label: handschrift @nl
preferred label: manuscrit @ca
preferred label: Manuskript @de
preferred label: manuscris @ro
preferred label: 手稿 @zh
alternative label: rokopis @sl
preferred label: manuscrito @gl
broader: tekst
editorial note: Published @en
preferred label: 원고 @ko
preferred label: kézirat @hu
preferred label: manuscript @en
preferred label: χειρόγραφο @el
alternative label: рукописна грађа
alternative label: El yazması @tr
preferred label: käsikirjoitus @fi
preferred label: рукопис
alternative label: Handschrift @de
preferred label: рукопись @ru
preferred label: مخطوطة @ar
preferred label: manuskript @da
alternative label: rukopisna građa
type: Concept
definition: A manuscript is a work of any kind (text, inscription, music score, map, etc.) written entirely by hand. [Source: https://products.abc-clio.com/ODLIS/odlis_m.aspx] @en

музичка композиција
alternative label: obra musical @es
preferred label: skladba @sl
preferred label: compoziţie muzicală @ro
preferred label: musikværk @da
alternative label: composicion musical @es
preferred label: 음악 @ko
alternative label: obra de musica @es
preferred label: composición musical @es
preferred label: sävellys @fi
preferred label: composició musical @ca
alternative label: 음악작품 @ko
preferred label: تأليف موسيقي @ar
definition: Musical composition can refer to an original piece of music, the structure of a musical piece, or the process of creating a new piece of music. [Source: https://en.wikipedia.org/wiki/Musical_composition ] @en
alternative label: pieza musical @es
alternative label: pieza de musica @es
alternative label: Tonsatz @de
type: Concept
preferred label: μουσική σύνθεση @el
preferred label: музыкальное произведение @ru
preferred label: muzička kompozicija
preferred label: hudební skladba @cs
preferred label: zenei alkotás @hu
broader: zvučni zapis
preferred label: composition musicale @fr
alternative label: 音乐作品 @zh
alternative label: قطعة موسيقية @ar
preferred label: musical composition @en
preferred label: musikalische Komposition @de
alternative label: 音樂 @zh
alternative label: glasbeno delo @sl
in scheme: Resource Types
preferred label: musikalisk komposition @sv
preferred label: muzikale compositie @nl
alternative label: 音樂作品 @zh
alternative label: pieza de música @es
editorial note: Published @en
preferred label: müzikal kompozisyon @tr
alternative label: hudební kompozice @cs
alternative label: partitura @ca
preferred label: composizione musicale @it
preferred label: музичний твір @uk
preferred label: 音乐 @zh
preferred label: 音楽 @ja
alternative label: obra de música @es
preferred label: composição musical @pt
alternative label: komposition @da

zvučni zapis
preferred label: zvuk @cs
preferred label: звук @uk
alternative label: ملف صوتي / تسجيل صوتي @ar
preferred label: 音声・音楽 @ja
preferred label: son @fr
preferred label: ääni @fi
editorial note: Published @en
preferred label: ljud @sv
preferred label: صوت @ar
alternative label: 聲音 @zh
top concept of: Resource Types
preferred label: звучни запис
preferred label: som @pt
preferred label: sunet @ro
preferred label: Ton @de
preferred label: sound @en
preferred label: sonido @es
definition: A resource primarily intended to be heard. Examples include a music playback file format, an audio compact disc, and recorded speech or sounds. [Source: http://dublincore.org/documents/dcmi-terms/#dcmitype-Sound] @en
narrower: музичка композиција
alternative label: document sonore @fr
preferred label: lyd @da
preferred label: 소리 @ko
type: Concept
broad match: MediaObject
preferred label: 声音 @zh
preferred label: suono @it
preferred label: ses @tr
alternative label: enregistrement sonore @fr
preferred label: geluid @nl
in scheme: Resource Types
preferred label: zvočni zapis @sl
preferred label: so @ca
alternative label: zvok @sl

veb-sajt
alternative label: pagina web @es
alternative label: internet prezentacija
preferred label: website @nl
alternative label: webové stránky @cs
preferred label: verkkosivusto @fi
editorial note: Published @en
preferred label: webové sídlo @cs
alternative label: páginas web @es
preferred label: webbsida @sv
broader: interaktivna građa
preferred label: web sitesi @tr
preferred label: weboldal @hu
preferred label: Webseite @de
alternative label: pàgina web @ca
alternative label: site @ro
preferred label: 웹사이트 @ko
alternative label: pagină web @ro
alternative label: página web @pt
preferred label: ウェブサイト @ja
alternative label: portal web @ca
preferred label: вебсайт @ru
preferred label: sitio web @gl
alternative label: portal @es
preferred label: lloc web @ca
alternative label: 讨论会 @zh
alternative label: sítio na internet @pt
preferred label: موقع إلكتروني @ar
definition: A collection of related web pages containing text, images, videos and/or other digital assets that are addressed relative to a common Uniform Resource Locator (URL). A web site is hosted on at least one web server, accessible via a network such as the Internet or a private local area network. [Source: http://purl.org/spar/fabio/WebSite] @en
preferred label: веб-сајт
preferred label: вебсторінка @uk
alternative label: servidor web @es
preferred label: sítio web @pt
type: Concept
alternative label: webpage @en
alternative label: 網站 @zh
preferred label: site web @fr
preferred label: spletna stran @sl
alternative label: paginas web @es
alternative label: portail web @fr
preferred label: 网站 @zh
in scheme: Resource Types
alternative label: интернет презентација
alternative label: веб-страница
alternative label: veb-stranica
preferred label: pagină de internet @ro
alternative label: pagine web @it
alternative label: موقع ويب @ar
preferred label: sito web @it
preferred label: hjemmeside @da
alternative label: sitios web @es

лабораторијске белешке
preferred label: laboratóriumi jegyzetfüzet @hu
preferred label: лабораторні нотатки @uk
preferred label: laboratorium-notitieboek @nl
preferred label: cuaderno de laboratorio @es
preferred label: laboratory notebook @en
preferred label: caderno de laboratorio @gl
alternative label: quadern de camp @ca
definition: A laboratory notebook (colloq. lab notebook or lab book) is a primary record of research. Researchers use a lab notebook to document their hypotheses, experiments and initial analysis or interpretation of these experiments. This label is used both for traditional and electronic laboratory notebook. [Source: Adapted from https://en.wikipedia.org/wiki/Lab_notebook] @en
broader: скуп података
preferred label: лабораторный блокнот @ru
type: Concept
alternative label: labbjournal @sv
narrow match: ComputationalNotebook
preferred label: quaderno di laboratorio @it
alternative label: laboratorijski zapis @sl
in scheme: Resource Types
alternative label: cuaderno electrónico de laboratorio @es
preferred label: caderno de laboratório @pt
preferred label: laborationsjournal @sv
preferred label: Laborjournal @de
preferred label: laboratuvar notları @tr
alternative label: laboratorijski zvezek @sl
preferred label: llibreta de laboratori @ca
preferred label: 연구 노트 @ko
preferred label: laboratorienotesbog @da
preferred label: carnet de laboratoire @fr
alternative label: quadern de laboratori @ca
preferred label: 实验室记录本 @zh
alternative label: cahier de laboratoire @fr
preferred label: εργαστηριακό τετράδιο @el
preferred label: ملاحظات مختبرية @ar
preferred label: caiet de laborator @ro
preferred label: laboratorijska beležka @sl
preferred label: laboratorijske beleške
preferred label: 実験ノート @ja
preferred label: laboratoriopäiväkirja @fi

видео
preferred label: vídeo @pt
type: Concept
alternative label: видео запис
preferred label: video @en
preferred label: فيديو @ar
alternative label: 动态影像 @zh
preferred label: 録画資料 @ja
in scheme: Resource Types
preferred label: vidéo @fr
preferred label: 视频 @zh
preferred label: Video @de
broader: покретне слике
alternative label: video zapis
broad match: MovingImage
preferred label: 비디오 @ko
preferred label: videó @hu
alternative label: film @ro
definition: Media that makes use of images (usually "moving"), with or without sound, over a period of playback time. [Source :https://support.contributors.jstor.org/hc/en-us/articles/11971132444439-JSTOR-Content-and-Resource-Types] @en
broad match: Movie
alternative label: 動態影像 @zh
editorial note: Published @en
preferred label: відео @uk
alternative label: 視頻 @zh

klinička studija
preferred label: klinična študija @sl
preferred label: Klinik çalışması @tr
broader: извештај
editorial note: Published @en
preferred label: клінічне дослідження @uk
preferred label: клиническое исследование @ru
preferred label: étude clinique @fr
preferred label: estudo clínico @gl
preferred label: klinische studie @nl
preferred label: studiu clinic @ro
preferred label: klinikai vizsgálat @hu
preferred label: دراسة سريرية @ar
related match: d4e2502
preferred label: 臨床研究 @ja
definition: A work that reports on the results of a research study to evaluate interventions or exposures on biomedical or health-related outcomes. The two main types of clinical studies are interventional studies (clinical trials) and observational studies. While most clinical studies concern humans, this publication type may be used for clinical veterinary articles meeting the requisites for humans. [Source: https://www.ncbi.nlm.nih.gov/mesh/2009830] @en
preferred label: estudi clínic @ca
preferred label: estudio clínico @es
preferred label: kliininen tutkimus @fi
preferred label: clinical study @en
preferred label: klinisk studie @sv
preferred label: 临床研究 @zh
broad match: studyregistration
preferred label: klinische Studie @de
type: Concept
alternative label: klinisch onderzoek @nl
preferred label: 임상 연구 @ko
preferred label: studio clinico @it
alternative label: ensaio clínico @pt
preferred label: klinisk rapport @da
in scheme: Resource Types
preferred label: κλινική μελέτη @el
preferred label: клиничка студија
alternative label: essai clinique @fr

приказ
preferred label: reseña @es
alternative label: bespreking @nl
alternative label: recension @es
preferred label: review @nl
preferred label: 评论 @zh
preferred label: рецензія @uk
preferred label: レビュー @ja
preferred label: recenzija
alternative label: revisão @pt
alternative label: granskning @sv
alternative label: recenzie @ro
type: Concept
alternative label: article de synthèse @fr
narrower: приказ књиге
preferred label: arvio @fi
alternative label: recensió @ca
alternative label: 評論 @zh
alternative label: рецензија
alternative label: критички приказ
preferred label: recensione @it
preferred label: مراجعة @ar
alternative label: comentari @ca
preferred label: anmeldelse @da
broad match: Text
alternative label: 评审 @zh
in scheme: Resource Types
preferred label: recenze @cs
preferred label: ressenya @ca
alternative label: critica @es
preferred label: 리뷰 @ko
alternative label: comentario @es
alternative label: recensão crítica @pt
alternative label: resenha @pt
preferred label: Rezension @de
narrow match: PeerReview
preferred label: recensión @gl
preferred label: ανασκόπηση @el
preferred label: recensão @pt
alternative label: 综述 @zh
narrow match: D016454
broader: tekst
preferred label: gözden geçirme @tr
definition: A review of others' published work. [Source: Adapted from https://sparontologies.github.io/fabio/current/fabio.html#d4e5273] @en
preferred label: revizuire @ro
preferred label: prikaz
narrower: recenzija
alternative label: kritički prikaz
alternative label: 綜述 @zh
narrower: komentar
alternative label: rassegna @it
alternative label: revisió @ca
preferred label: synthèse @fr
preferred label: recenzió @hu
preferred label: рецензия @ru
alternative label: crítica @es
alternative label: 評審 @zh

теза
preferred label: thesis @en
preferred label: afhandling @da
preferred label: avhandling @sv
preferred label: tese @pt
alternative label: 畢業論文 @zh
preferred label: 学位论文 @zh
definition: A book authored by a student containing a formal presentations of research outputs submitted for examination in completion of a course of study at an institution of higher education, to fulfil the requirements for an academic degree. Also known as a dissertation. [Source: https://sparontologies.github.io/fabio/current/fabio.html#d4e5748] @en
alternative label: schriftliche Abschlussarbeit @de
preferred label: szakdolgozat @hu
preferred label: 学位論文 @ja
preferred label: диссертация @ru
preferred label: zaključno delo študija @sl
broader: tekst
preferred label: тези і дисертації @uk
preferred label: scriptie @nl
preferred label: Hochschulschrift @de
alternative label: дисертација
preferred label: أطروحة @ar
narrower: докторска дисертација
preferred label: tesi @ca
preferred label: tesis @es
preferred label: 학위논문 @ko
preferred label: tez @tr
alternative label: 學位論文 @zh
broad match: Text
alternative label: 毕业论文 @zh
preferred label: opinnäyte @fi
in scheme: Resource Types
preferred label: kvalifikační práce @cs
preferred label: teză @ro
narrower: diplomski rad
alternative label: rapport de thèse @fr
type: Concept
narrower: master/magistarska teza
alternative label: disertacija
preferred label: διατριβή @el
preferred label: teza
preferred label: thèse @fr
alternative label: mémoire de thèse @fr

knjiga
preferred label: libro @gl
preferred label: carte @ro
preferred label: kirja @fi
alternative label: livre @fr
alternative label: monografia @it
preferred label: livro @pl
alternative label: 专著 @zh
preferred label: 図書 @ja
alternative label: 書 @zh
preferred label: књига
alternative label: 專著 @zh
narrow match: BookReview
preferred label: Buch @de
narrow match: d4e2300
alternative label: монографија
preferred label: boek @nl
alternative label: 图书 @zh
narrow match: BookChapter
type: Concept
alternative label: 圖書 @zh
alternative label: monografía @es
preferred label: ouvrage @fr
narrower: поглавље у књизи
preferred label: βιβλίο @el
preferred label: monografija
in scheme: Resource Types
related match: Book
preferred label: книга @uk
alternative label: obra monográfica @es
preferred label: kniha @cs
broad match: Text
preferred label: könyv @hu
alternative label: Monographie @de
preferred label: bok @sv
alternative label: monograph @en
preferred label: bog @da
preferred label: book @en
alternative label: obra monografica @es
preferred label: 도서 @ko
alternative label: audiobook @en
alternative label: e-book @en
alternative label: monographie @fr
definition: A non-serial publication that is complete in one volume or a designated finite number of volumes. [Source: Adapted from http://purl.org/eprint/type/Book] @en
preferred label: kitap @tr
alternative label: افرودة @ar
broader: tekst
alternative label: monografie @cs
preferred label: 书 @zh
alternative label: books @en
preferred label: llibre @ca
preferred label: كتاب @ar

report to funding agency
alternative label: rapportage voor financier @nl
preferred label: 给资助机构的报告 @zh
in scheme: Resource Types
type: Concept
preferred label: 助成研究成果報告書 @ja
preferred label: تقرير لوكالة تمويل @ar
preferred label: informe per una agència de finançament @ca
preferred label: rapport à l'intention du financeur @fr
expires: 2021-03-12
alternative label: 給資助機構的報告 @zh
alternative label: reporte a agencia de financiamento @es
alternative label: poročilo financerjem projekta @sl
preferred label: fon sağlayıcıya rapor @tr
preferred label: rapporto a un'agenzia di finanziamento @it
preferred label: relatório para organismo financiador @pt
preferred label: informe a organismo financiador @es
editorial note: Deprecated @en
preferred label: poročilo financerjem raziskave @sl
definition: A report to a funding agency is a document written by beneficiaries of project grants. The reporting documents can be e.g. periodic reports about progress of scientific and technical work and final report. For deliverables use ‘Project deliverable’. [Source: http://ec.europa.eu/research/participants/fp7documents/funding-guide/6_projects/reports/reports_en.htm ] @en
alternative label: relatório para agência de financiamento @pt
alternative label: informe a agencia financiadora @es
preferred label: Bericht an Förderorganisation @de
alternative label: relatório para financiador @pt
alternative label: končno poročilo o rezultatih raziskav @sl
top concept of: Resource Types
preferred label: zpráva pro poskytovatele podpory @cs
alternative label: rapport au financeur @fr

patent
definition: A patent or patent application. @en
preferred label: patentti @fi
preferred label: brevet @fr
preferred label: 特許 @ja
definition: A set of exclusive rights granted by law to applicants for inventions that are new, non-obvious and commercially applicable. A patent is valid for a limited period (generally 20 years), during which time patent holders can commercially exploit their inventions on an exclusive basis. [Source: https://www.wipo.int/edocs/pubdocs/en/wipo_pub_943_2018.pdf] @en
preferred label: патент
alternative label: Patentanmeldung @de
preferred label: 专利 @zh
preferred label: 특허 @ko
narrower: патентна пријава
preferred label: patente @es
preferred label: Patent @de
top concept of: Resource Types
narrower: патент за дизајн
narrower: zaštićena biljna sorta
preferred label: brevetto @it
alternative label: 專利 @zh
broad match: Text
type: Concept
narrower: патентирани софтвер
preferred label: ευρεσιτεχνία @el
in scheme: Resource Types
alternative label: patente de invención @es
alternative label: patents @en
alternative label: patente de invencion @es
preferred label: براءة اختراع @ar
preferred label: szabadalom @hu
narrower: мали патент
narrower: patentirana sorta

podaci iz kliničkih ispitivanja
broad match: Dataset
preferred label: podatki kliničnih preskušanj @sl
preferred label: 임상시험 데이터 @ko
preferred label: 临床试验数据 @zh
preferred label: klinische studie data @nl
preferred label: δεδομένα κλινικών δοκιμών @el
preferred label: بيانات تجارب سريرية @ar
definition: Data resulting from a research study in which one or more human subjects are prospectively assigned to one or more interventions (which may include placebo or other control) to evaluate the effects of those interventions on health-related biomedical or behavioral outcomes. [Source: Adapted from https://grants.nih.gov/policy/clinical-trials/definition.htm] @en
editorial note: Published @en
alternative label: date obţinute în studii clinice @ro
alternative label: подаци из клиничких студија
alternative label: essai thérapeutique @fr
preferred label: datos de ensaios clínicos @gl
preferred label: дані клінічних досліджень @uk
alternative label: podaci iz kliničkih studija
preferred label: 臨床試験データ @ja
preferred label: dades d'assajos clínics @ca
preferred label: data fra kliniske forsøg @da
preferred label: kliinisellä kokeella tuotettu data @fi
preferred label: ensayo clínico @es
alternative label: klinično preskušanje @sl
alternative label: klinisch-wetenschappelijke data @nl
alternative label: dades d'estudis clínics @ca
preferred label: данные клинических испытаний @ru
alternative label: randomized control trial @en
alternative label: date clinice de testare @ro
preferred label: klinische Daten @de
broad match: studyregistration
preferred label: date din studii clinice @ro
preferred label: donnée d'essai clinique @fr
type: Concept
alternative label: klinisk forsøg data @da
preferred label: dados de ensaios clínicos @pt
preferred label: klinik deney verisi @tr
preferred label: dati di trial clinico @it
in scheme: Resource Types
broader: скуп података
preferred label: подаци из клиничких испитивања
preferred label: klinikai vizsgálati adatok @hu
preferred label: clinical trial data @en

podaci merenja i ispitivanja
preferred label: measurement and test data @en
preferred label: 測定・評価データ @ja
preferred label: данные измерений и испытаний @ru
related match: http://vocabs.lter-europe.net/elter_cl/10017
preferred label: mérési és tesztelési adatok @hu
preferred label: dados de medição e de ensaio @pt
preferred label: måle- og testdata @da
definition: Data resulting from assessing specific properties (or characteristics) of beings, things, phenomena, (and/ or processes) by applying pre-established standards and/or specialized instruments or techniques. [Source: Adapted from https://ddialliance.org/Specification/DDI-CV/ModeOfCollection_3.0.html] @en
preferred label: dati di misurazione e test @it
preferred label: 测量与测试数据 @zh
preferred label: merilni in testni podatki @sl
preferred label: Mess- und Testdaten @de
preferred label: дані вимірювання і випробування @uk
preferred label: datos de medicións e probas @gl
preferred label: 측정・시험 데이터 @ko
preferred label: بيانات قياس واختبار @ar
type: Concept
preferred label: date de măsurare și testare @ro
in scheme: Resource Types
broader: скуп података
preferred label: подаци мерења и испитивања
preferred label: mittaus- ja testausdata @fi
preferred label: ölçüm ve test verisi @tr
preferred label: meet- en testdata @nl
preferred label: dades de mesures i proves @ca
preferred label: δεδομένα μετρήσεων και δοκιμών @el
preferred label: donnée de mesure et d'essai @fr
preferred label: datos de medición y prueba @es

erratum
preferred label: تصحيح @ar
preferred label: corrigendum
alternative label: ملحق تصحيحي @ar
preferred label: düzeltme @tr
preferred label: popravek članka @sl
alternative label: Berichtigung @de
preferred label: corrección de erros @gl
alternative label: fe d'errates @ca
alternative label: исправление @ru
preferred label: corrigenda @fi
alternative label: исправка
alternative label: correcció @ca
type: Concept
alternative label: ispravka
related match: d4e3154
preferred label: errata @sv
broader: чланак у часопису
preferred label: berigtigelse @da
preferred label: hibajegyzék @hu
in scheme: Resource Types
preferred label: 정오표 @ko
preferred label: correcció d’errors @ca
preferred label: 勘误表（指对出版物中错误的更正或修正表） @zh
preferred label: виправлення @uk
preferred label: 正誤表 @ja
alternative label: fe de erratas @es
preferred label: Korrigendum @de
preferred label: правки @ru
editorial note: Published @en
broad match: d4e2698
definition: A formal correction to an error introduced by the author into a previously published document. (adapted from https://sparontologies.github.io/fabio/current/fabio.html#d4e2712) @en
preferred label: παρόραμα @el
preferred label: rectificare @ro

softver za nauku
preferred label: 연구용소프트웨어 @ko
preferred label: software di ricerca @it
alternative label: soft de cercetare @ro
preferred label: дослідницьке програмне забезпечення @uk
preferred label: software de cercetare @ro
alternative label: برمجيات بحث @ar
preferred label: programari acadèmic @ca
preferred label: onderzoekssoftware @nl
preferred label: Araştırma yazılımı @tr
preferred label: software de investigación @gl
alternative label: naučni softver
alternative label: programari d’anàlisi @ca
editorial note: Published @en
broad match: Software
preferred label: kutatási szoftver @hu
preferred label: tutkimusohjelmisto @fi
preferred label: 研究软件 @zh
alternative label: istraživački softver
alternative label: program de cercetare @ro
preferred label: исследовательское программное обеспечение @ru
preferred label: ερευνητικό λογισμικό @el
preferred label: raziskovalna programska oprema @sl
alternative label: tutkimussovellus @fi
preferred label: софтвер за науку
broader: рачунарски програм
type: Concept
alternative label: истраживачки софтвер
preferred label: logiciel de recherche @fr
preferred label: 研究用ソフトウェア @ja
alternative label: forskningsmjukvara @sv
definition: Software that is used to generate, process or analyse results that you intend to appear in a publication (either in a journal, conference paper, monograph, book or thesis). Research software can be anything from a few lines of code written by yourself, to a professionally developed software package. [Source: https://datashare.ed.ac.uk/handle/10283/785] @en
preferred label: forskningsprogramvara @sv
in scheme: Resource Types
preferred label: research software @en
alternative label: programari per recerca @ca
preferred label: Forschungssoftware @de
alternative label: научни софтвер
preferred label: برمجيات بحثية @ar
preferred label: forskningssoftware @da

покретне слике
preferred label: pohyblivý obraz @cs
preferred label: imagem animada @pt
type: Concept
preferred label: imatge en moviment @ca
preferred label: Bewegte Bilder @de
preferred label: immagine dinamica @it
preferred label: gibljiva slika @sl
alternative label: imagine dinamică @ro
preferred label: image animée @fr
preferred label: рухоме зображення @uk
in scheme: Resource Types
preferred label: 동영상 @ko
alternative label: 動畫 @zh
preferred label: صورة متحركة @ar
preferred label: moving image @en
preferred label: 运动图像 @zh
preferred label: imaxe en movemento @gl
preferred label: rörlig bild @sv
preferred label: imagine în mișcare @ro
preferred label: filmmateriaal @nl
preferred label: движущееся изображение @ru
alternative label: imagem em movimento @pt
definition: A moving display, either generated dynamically by a computer program or formed from a series of pre-recorded still images imparting an impression of motion when shown in succession. [Source: http://purl.org/spar/fabio/MovingImage] @en
alternative label: audiovisual @en
narrower: видео
alternative label: سمعي بصري @ar
preferred label: imagen dinámica @es
alternative label: imagen en movimiento @es
preferred label: pokretne slike
preferred label: hareketli görüntü @tr
preferred label: liikkuva kuva @fi
preferred label: mozgókép @hu
alternative label: 運動圖像 @zh
preferred label: κινούμενες εικόνες @el
alternative label: imagen dinamica @es
broader: слика
alternative label: 动画 @zh
preferred label: 動画 @ja

kartografska građa
in scheme: Resource Types
preferred label: kartographisches Material @de
preferred label: 地图类资料 @zh
definition: Any material representing the whole or part of the earth or any celestial body at any scale. Cartographic materials include two- and three-dimensional maps and plans (including maps of imaginary places); aeronautical, navigational, and celestial charts; atlases; globes; block diagrams; sections; aerial photographs with a cartographic purpose; bird's-eye views (map views), etc. [Source: http://www.loc.gov/marc/cfmap.html] @en
preferred label: cartografisch materiaal @nl
alternative label: material cartografico @es
alternative label: kartografski material @sl
preferred label: material cartográfico @gl
broad match: Map
narrower: mapa
preferred label: material cartografic @ro
alternative label: kartografski materijal
preferred label: material cartogràfic @ca
preferred label: kartografiske materialer @da
alternative label: картографски материјал
preferred label: cartographic material @en
preferred label: χαρτογραφικό υλικό @el
preferred label: kartografický dokument @cs
preferred label: cartografia @it
editorial note: Published @en
preferred label: kartografik materyal @tr
preferred label: térképészeti anyag @hu
preferred label: картографічний матеріал @uk
preferred label: 地図資料 @ja
type: Concept
top concept of: Resource Types
alternative label: 地圖類資料 @zh
preferred label: 지도자료 @ko
preferred label: matériel cartographique @fr
alternative label: materiale cartografico @it
preferred label: kartografsko gradivo @sl
preferred label: картографический материал @ru
preferred label: kartografinen aineisto @fi
preferred label: مادة خرائطية @ar
preferred label: kartografiskt material @sv
preferred label: картографска грађа

патент за дизајн
preferred label: brevet de conception @fr
preferred label: 意匠特許 @ja
in scheme: Resource Types
preferred label: patente de deseño @gl
preferred label: formatervezési minta @hu
preferred label: патент на дизайн @uk
preferred label: designskydd @sv
preferred label: патент на образец @ru
preferred label: Eingetragenes Design @de
definition: A patent granted to any person who has invented any new and non-obvious ornamental design for an article of manufacture. The design patent protects only the appearance of an article, but not its structural or functional features. [Source: Adapted from https://www.uspto.gov/patents/basics/types-patent-applications/design-patent-application-guide#def] @en
preferred label: brevet de design @ro
preferred label: mallipatentti @fi
alternative label: registo de modelo @pt
preferred label: design patent @en
preferred label: براءة اختراع تصميم @ar
preferred label: designregistrering @da
alternative label: brevet de proiectare @ro
alternative label: mönsterskydd @sv
preferred label: modelbescherming @nl
broader: patent
preferred label: patent za oblikovanje @sl
preferred label: patent de disseny @ca
alternative label: tasarım tescili @tr
broad match: d4e4551
preferred label: registo de desenho @pt
preferred label: tasarım patenti @tr
preferred label: patent za dizajn
preferred label: 디자인 특허 @ko
preferred label: 设计专利 @zh
type: Concept
preferred label: patente de diseño @es
preferred label: brevetto di design @it

neobjavljeno saopštenje sa konferencije
preferred label: ورقة مؤتمر ليست ضمن وقائع المؤتمر @ar
preferred label: άρθρο συνεδρίου που δε δημοσιεύτηκε στα πρακτικά @el
alternative label: konferencepapir ikke i konferencehandlinger @da
preferred label: neobjavljen članek na konferenci @sl
preferred label: conference paper not in proceedings @en
preferred label: доповідь конференції яка не увійшла до збірника @uk
preferred label: yayınlanmamış konferans bildirisi @tr
alternative label: 未發表在會議論文集中的文章 @zh
definition: A paper, typically the realization of a research paper reporting original research findings. Use this label when the paper is not published in a proceeding. [Source: Adapted from http://purl.org/spar/fabio/ConferencePaper] @en
preferred label: konferenciaköteten kívüli közlemény @hu
preferred label: konferenční příspěvek nezahrnutý ve sborníku @cs
alternative label: artigo não publicado nas atas da conferência @pt
alternative label: comunicação não publicada nas atas do congresso @pt
preferred label: comunicación no publicada en actas de congreso @es
type: Concept
preferred label: comunicació de congrés no publicada @ca
preferred label: конференционный доклад не включенный в материалы конференции @ru
editorial note: Proposed deprecated @en
in scheme: Resource Types
preferred label: paper ej i proceeding @sv
preferred label: konferenceoplæg ikke i konferencehandlinger @da
preferred label: lucrare de conferinţă nepublicată @ro
alternative label: artigo não publicado nas atas do congresso @pt
preferred label: 非会议集里的会议论文 @zh
preferred label: 미게재 학술대회 논문 @ko
preferred label: comunicación de congreso non publicada nas actas @gl
preferred label: необјављено саопштење са конференције
preferred label: 会議発表論文（会議録未掲載） @ja
preferred label: comunicazione non pubblicata in atti di congresso @it
alternative label: konferenceartikel ikke i konferencehandlinger @da
preferred label: article dans une conférence non publié dans les actes @fr
preferred label: Konferenzbeitrag nicht im Tagungsband @de
broader: konferencijski prilog
alternative label: article de conférence non publié dans les actes @fr
preferred label: conferentie artikel niet in proceedings @nl
preferred label: comunicação não publicada nas atas da conferência @pt
preferred label: konferenssiesitelmä erillisjulkaisuna @fi

shema konfiguracije
preferred label: 레이아웃 디자인( @ko
preferred label: layout design @da
preferred label: дизайн макета @uk
preferred label: načrt postavitve @sl
preferred label: topoğrafya @tr
alternative label: schéma d'implantation @fr
in scheme: Resource Types
preferred label: piirikaavio @fi
preferred label: σχεδιασμός διάταξης @el
preferred label: topografía de circuítos integrados @gl
broad match: https://ncicb.nci.nih.gov/ncimbrowser/ConceptReport.jsp
preferred label: Layout @de
preferred label: lay-out ontwerp @nl
alternative label: макетирование @ru
alternative label: kytkentäkaavio @fi
alternative label: Layoutentwurf @de
preferred label: topografía de productos semiconductores @es
preferred label: 布图设计 @zh
preferred label: schéma de configuration @fr
preferred label: térbeli elrendezés @hu
alternative label: maquetació @ca
preferred label: layout di impianto @it
broader: дизајн
preferred label: disseny de maqueta @ca
preferred label: تصميم التخطيط @ar
alternative label: 레이아웃 설계 @ko
definition: Layout-design (topography) means the three-dimensional disposition, however expressed, of the elements of an integrated circuit (at least one of which is an active element) and of some or all of the interconnections of an integrated circuit, or such a three-dimensional disposition prepared for an integrated circuit intended for manufacture [Source: https://www.wipo.int/edocs/lexdocs/laws/en/hk/hk028en.pdf] @en
preferred label: layoutdesign @sv
preferred label: схема конфигурације
alternative label: design de machetă @ro
preferred label: レイアウト設計 @ja
alternative label: design de aspect @ro
preferred label: topografia de produtos semicondutores @pt
preferred label: компоновка @ru
type: Concept

анотација
preferred label: 注釈 @ja
alternative label: glosa @pt
broad match: Text
preferred label: anotació @ca
alternative label: dipnot @tr
preferred label: anotação @pt
alternative label: 詮釋 @zh
in scheme: Resource Types
alternative label: Entscheidungsanmerkung @de
preferred label: Urteilsanmerkung @de
preferred label: kommentaari @fi
alternative label: anotación @es
alternative label: белешка
preferred label: annotation @en
alternative label: comentário @pt
preferred label: 주석 @ko
alternative label: komentar
alternative label: коментар
alternative label: annotáció @hu
alternative label: 註釋 @zh
definition: An annotation in the sense of a legal note is a legally explanatory comment on a decision handed down by a court or arbitral tribunal. [Source: DRIVER info:eu-repo definition] @en
alternative label: 注释 @zh
alternative label: реферат @ru
preferred label: anmærkning @da
alternative label: beleška
preferred label: annotering @sv
alternative label: glossa @ca
preferred label: právní komentář rozsudku nebo rozhodnutí @cs
alternative label: annotazione @it
preferred label: commento @it
preferred label: анотація @uk
preferred label: nota de xurisprudencia @gl
alternative label: nota @es
preferred label: аннотация @ru
broader: tekst
alternative label: nota a un texto de jurisprudencia @es
alternative label: pravno mnenje @sl
alternative label: opomba @sl
alternative label: zaznamba @sl
related match: d4e3790
preferred label: تعليق توضيحي @ar
alternative label: 诠释 @zh
alternative label: apontamento @pt
preferred label: 标注 @zh
alternative label: adnotare @ro
type: Concept
preferred label: açıklama @tr
preferred label: anotacija
alternative label: comentario @es
preferred label: adnotare legală @ro
alternative label: σχόλιο @el
preferred label: nota de jurisprudencia @es
alternative label: 標注 @zh
preferred label: annotatie @nl
preferred label: zaznamek @sl

извештај
alternative label: referat @ro
alternative label: relación @es
preferred label: rapport @da
type: Concept
preferred label: informe @ca
alternative label: estudo @gl
preferred label: jelentés @hu
alternative label: memoria @es
alternative label: 科研报告 @zh
narrower: klinička studija
in scheme: Resource Types
preferred label: report @en
preferred label: έκθεση @el
broad match: Text
alternative label: reporte @es
alternative label: estudi @ca
preferred label: raport @ro
preferred label: rapporto @it
alternative label: 研究报告 @zh
alternative label: 调研报告 @zh
alternative label: estudio @es
preferred label: 报告 @zh
narrower: план управљања подацима
narrower: analiza politike
preferred label: rapor @tr
preferred label: 報告書 @ja
preferred label: تقرير @ar
narrower: меморандум
narrower: πρωτόκολλο σύνθεσης γνώσης
alternative label: reports @en
narrower: извештај о истраживању
preferred label: zpráva @cs
preferred label: отчет @ru
definition: A report is a separately published record of research findings, research still in progress, policy developments and events, or other technical findings, usually bearing a report number and sometimes a grant number assigned by the funding agency. Also, an official record of the activities of a committee or corporate entity, the proceedings of a government body, or an investigation by an agency, whether published or private, usually archived or submitted to a higher authority, voluntarily or under mandate. In a more general sense, any formal account of facts or information related to a specific event or phenomenon, sometimes given at regular intervals. [Source: http://lu.com/odlis/odlis_R.cfm#report ] @en
preferred label: Bericht @de
preferred label: звіт @uk
preferred label: izveštaj
narrower: tehnički izveštaj
alternative label: relacion @es
alternative label: 報告 @zh
broader: tekst
narrower: резултат пројекта
preferred label: relatório @pt
preferred label: poročilo @sl
alternative label: paper @en
narrower: протокол истраживања
preferred label: raportti @fi

нотни запис
alternative label: music notation @en
alternative label: notskrift @sv
preferred label: notație muzicală @ro
alternative label: partitura @es
alternative label: noty @cs
alternative label: notacion musical @es
preferred label: нотная запись @ru
broader: tekst
editorial note: Published @en
preferred label: nota @tr
broad match: d4e4227
preferred label: partition @fr
preferred label: Musiknotation @de
preferred label: musical notation @en
preferred label: 乐谱 @zh
alternative label: musikalier @sv
alternative label: partition de musique @fr
preferred label: kotta @hu
preferred label: notació musical @ca
preferred label: notni zapis
preferred label: notación musical @es
preferred label: musikalsk notation @da
preferred label: μουσική σημειογραφία @el
preferred label: note @sl
preferred label: musiknotation @sv
type: Concept
alternative label: Notenschrift @de
preferred label: hudební zápis @cs
alternative label: 樂譜 @zh
in scheme: Resource Types
definition: Symbols used to write music, as in a music score, and to express mathematical concepts. [Source: Adapted from https://products.abc-clio.com/ODLIS/odlis_n.aspx] @en
preferred label: 楽譜 @ja
alternative label: مدونة موسيقية @ar
preferred label: notazione musicale @it
preferred label: nuottikirjoitus @fi
preferred label: muzieknotatie @nl
alternative label: partition musicale @fr
alternative label: notenschrift @nl
preferred label: ноти @uk
preferred label: notação musical @pt
preferred label: تدوينة موسيقية @ar

pregledni članak
preferred label: pregledni znanstveni članek @sl
alternative label: artículo de reseña @es
preferred label: レビュー論文 @ja
alternative label: pregledni naučni članak
alternative label: articulo de reseña @es
alternative label: articol de analiză @ro
narrow match: D016454
alternative label: 综述评论性论文 @zh
preferred label: översiktsartikel @sv
preferred label: обзорная статья @ru
preferred label: 리뷰 논문 @ko
alternative label: 综述论文 @zh
preferred label: article de synthèse @fr
alternative label: article de revisió @ca
definition: A review article is a secondary source, that is, it is written about other articles, and does not report original research of its own. [Source: Adapted from http://apus.libanswers.com/faq/2324] @en
preferred label: artigo de revisión @gl
broader: чланак у часопису
alternative label: 综述评论性文章 @zh
preferred label: szakirodalmi áttekintő cikk @hu
alternative label: articulo de revision @es
preferred label: άρθρο κριτικής @el
preferred label: artigo de revisão @pt
type: Concept
preferred label: artículo de revisión @es
preferred label: overzichtsartikel @nl
alternative label: pregledni rad
in scheme: Resource Types
preferred label: прегледни чланак
preferred label: articol de reviziune @ro
preferred label: مقال مراجعة @ar
alternative label: прегледни научни чланак
broad match: JournalArticle
preferred label: katsausartikkeli @fi
alternative label: recensie-artikel @nl
preferred label: litteraturgennemgang @da
broad match: Article
preferred label: derleme makale @tr
preferred label: Übersichtsartikel @de
broad match: d4e5310
preferred label: оглядова стаття @uk
preferred label: 综述文章 @zh
alternative label: 综述 @zh
alternative label: прегледни рад
preferred label: přehledový článek @cs
preferred label: review article @en
editorial note: Published @en

documente judiciare
type: Concept
alternative label: acte judiciare @ro
preferred label: atti giudiziari @it
alternative label: documenti giudiziari @it
preferred label: retsdokumenter @da
in scheme: Resource Types
preferred label: δικαστικά έγγραφα @el
preferred label: court documents @en
broad match: D016418
preferred label: 법원문서 @ko
definition: A set of judicial proceedings that record, physically or digitally, and in an orderly fashion, the development of a process or procedural actions so that they may be recorded and examined by the parties. This would include the set of judicial proceedings and any item within that set as a physical or electronic court document. Adapted from https://dpej.rae.es/lema/expediente-judicial with input from https://www.supremecourt.gov/case_documents.aspx @en
preferred label: судові матеріали @uk
alternative label: retsprotokoller @da
preferred label: 法庭文件 @zh
preferred label: processos judiciais @pt
preferred label: Prozessakte @de
alternative label: documentos judiciais @pt
preferred label: expediente xudicial @gl
preferred label: oikeudenkäyntiasiakirjat @fi
broad match: d4e3790
alternative label: dokumenti sodišč @sl
preferred label: expedient judicial @ca
editorial note: New concept included for version 4 or resource types Vocab @en
alternative label: documents judicials @ca
preferred label: rättsliga dokument @sv
preferred label: gerechtelijke documenten @nl
alternative label: document des tribunaux @fr
preferred label: bírósági dokumentumok @hu
preferred label: expediente judicial @es
broader: збирка
alternative label: Gerichtsakte @de
alternative label: sodni spisi @sl
preferred label: 裁判所文書 @ja
alternative label: documentation judiciaire @fr
preferred label: document judiciaire @fr
alternative label: matériel juridique @fr
preferred label: adli belgeler @tr
alternative label: Gerichtsdokumente @de
preferred label: sodni dokumenti @sl
preferred label: وثائق قضائية @ar

fizički uzorak
preferred label: fizikai minta @hu
preferred label: mostra física @gl
alternative label: carotte de sondage @fr
preferred label: 实物样本 @zh
preferred label: fyysinen näyte @fi
preferred label: prøve @da
preferred label: esemplare @it
preferred label: физический образец @ru
broad match: PhysicalObject
alternative label: spécimen @fr
preferred label: physical sample @en
preferred label: фізичний зразок @uk
top concept of: Resource Types
preferred label: 물리 샘플 @ko
editorial note: New concept included for version 4 of resource types Vocab @en
preferred label: عينة مادية @ar
definition: Physical samples include biological specimens, rock or mineral specimens, soil or sediment cores, plants and seeds, water quality samples, archaeological artefacts, or DNA and human tissue samples. Samples may be used in analyses and can be destroyed in this process, whereas specimens are preserved curated objects that can be continuously studied. Source: 23 Things Physical Samples https://eprints.gla.ac.uk/309016/1/309016.pdf @en
preferred label: amostra física @pt
preferred label: physische Probe @de
preferred label: fysiskt prov @sv
type: Concept
preferred label: monster @nl
alternative label: proefmonster @nl
preferred label: 物理的サンプル @ja
preferred label: fiziksel numune @tr
alternative label: prototip @ro
preferred label: mostră @ro
preferred label: muestra física @es
alternative label: campione fisico @it
in scheme: Resource Types
preferred label: échantillon @fr
preferred label: fizični vzorec @sl
preferred label: физички узорак

докторска дисертација
preferred label: doktori disszertáció @hu
definition: A thesis reporting the research undertaken during a period of graduate study leading to a doctoral degree. [Source: https://sparontologies.github.io/fabio/current/fabio.html#d4e3051] @en
preferred label: tesis doctoral @es
preferred label: διδακτορική διατριβή @el
preferred label: 박사논문 @ko
type: Concept
preferred label: thèse de doctorat @fr
preferred label: doctoral thesis @en
alternative label: 博士學位論文 @zh
preferred label: докторская диссертация @ru
alternative label: 博士研究生畢業論文 @zh
alternative label: doktorská práce @cs
alternative label: rapport de thèse de doctorat @fr
preferred label: tese de doutoramento @pt
in scheme: Resource Types
broad match: Thesis
alternative label: Habilitationsschrift @de
preferred label: Dissertation @de
preferred label: disertační práce @cs
alternative label: اطروحة @ar
preferred label: اطروحة دكتوراه @ar
preferred label: teză de doctorat @ro
alternative label: 博士研究生毕业文论 @zh
preferred label: докторська дисертація @uk
preferred label: doktorska disertacija
preferred label: tesi doctoral @ca
preferred label: doktorsavhandling @sv
preferred label: doktora tezi @tr
alternative label: doktorsko delo @sl
broader: теза
preferred label: 博士論文 @ja
preferred label: doktorafhandling @da
alternative label: dissertatie @nl
preferred label: väitöskirja @fi
preferred label: 博士学位论文 @zh
alternative label: mémoire de thèse de doctorat @fr
preferred label: proefschrift @nl
preferred label: tesi di dottorato @it
alternative label: tesis de doctorado @es
alternative label: ph.d.-afhandling @da

патентирани софтвер
in scheme: Resource Types
preferred label: patente de software @es
preferred label: patent de programari @ca
alternative label: softverski patent
preferred label: براءة اختراع برمجيات @ar
preferred label: ohjelmistopatentti @fi
preferred label: Softwarepatent @de
preferred label: mjukvarupatent @sv
preferred label: патент на программное обеспечение @ru
preferred label: software patent @en
preferred label: szoftverszabadalom @hu
broader: patent
preferred label: brevet de logiciel @fr
broad match: Software
alternative label: octrooi op software @nl
preferred label: ευρεσιτεχνία λογισμικού @el
preferred label: brevetto software @it
alternative label: brevet logiciel @fr
preferred label: ソフトウェア特許 @ja
preferred label: software-patent @da
type: Concept
preferred label: 软件著作权 @zh
broad match: d4e4551
preferred label: 소프트웨어 특허 @ko
preferred label: patent za programsko opremo @sl
preferred label: softwarepatent @nl
preferred label: патент на програмне забезпечення @uk
preferred label: yazılım patenti @tr
alternative label: софтверски патент
preferred label: patent de software @ro
preferred label: patentirani softver
alternative label: 软件专利 @zh
definition: In order to obtain a patent, a software invention must not fall under other non-patentable subject matter (for example, abstract ideas or mathematical theories) and has to fulfill the other substantive patentability criteria (for example, novelty, inventive step [non-obviousness] and industrial applicability [usefulness]). [Source: https://www.wipo.int/patents/en/faq_patents.html] @en

chapitre de rapport
alternative label: parte de relatório @pt
expires: 2021-03-12
alternative label: 報告部分 @zh
preferred label: part d'un informe @ca
preferred label: parte de un estudio @es
alternative label: parte de una relacion @es
preferred label: 报告部分 @zh
editorial note: Deprecated @en
preferred label: rapor bölümü @tr
preferred label: capítulo de relatório @pt
top concept of: Resource Types
preferred label: deelrapport @nl
preferred label: 報告書（部分） @ja
type: Concept
definition: part of a report @en
broad match: Report
alternative label: reportPart @en
preferred label: capitolo di rapporto tecnico @it
alternative label: partie de rapport @fr
preferred label: report part @en
alternative label: rapportdeel @nl
preferred label: Teilbericht @de
alternative label: parte de un informe @es
in scheme: Resource Types
alternative label: parte de una relación @es

статична слика
preferred label: imaxe fixa @gl
alternative label: imatge estàtica @ca
preferred label: imagine statică @ro
alternative label: статична визуелна представа
alternative label: statična vizuelna predstava
alternative label: 靜止圖像 @zh
preferred label: image fixe @fr
broader: слика
alternative label: imagem fixa @pt
alternative label: imagine fixă @ro
type: Concept
preferred label: still image @en
preferred label: statična slika
preferred label: imatge fixa @ca
preferred label: állókép @hu
preferred label: 정지영상 @ko
in scheme: Resource Types
alternative label: 静止图像 @zh
alternative label: imagem @pt
preferred label: still-kuva @fi
preferred label: nepohyblivý obraz @cs
alternative label: stillbild @sv
alternative label: 靜態圖像 @zh
alternative label: afbeelding @nl
preferred label: hareketsiz görüntü @tr
preferred label: stilstaandbeeld @nl
preferred label: 静止画 @ja
preferred label: 静态图像 @zh
preferred label: صورة ثابتة @ar
preferred label: imagem estática @pt
preferred label: Einzelbild @de
preferred label: imagen fija @es
preferred label: stillbillede @da
preferred label: неподвижное изображение @ru
preferred label: statična vizualna predstavitev @sl
preferred label: нерухоме зображення @uk
definition: A recorded static visual representation. This class of image includes diagrams, drawings, graphs, graphic designs, plans, photographs and prints. [Source: Adapted from http://purl.org/spar/fabio/StillImage] @en
preferred label: immagine fissa @it
broad match: Image

snimljeni podaci
broader: скуп података
preferred label: posneti podatki @sl
preferred label: optaget data @da
preferred label: kayıtlı veri @tr
preferred label: зафіксовані дані @uk
preferred label: 記録データ @ja
in scheme: Resource Types
preferred label: 记录数据 @zh
alternative label: opgenomen data @nl
alternative label: datos grabados @es
type: Concept
definition: Data registered by mechanical or electronic means, in a form that allows the information to be retrieved and/or reproduced. For example, images or sounds on disc or magnetic tape. [Source: Adapted from https://ddialliance.org/Specification/DDI-CV/ModeOfCollection_3.0.html] @en
preferred label: снимљени подаци
preferred label: tallennettu data @fi
broad match: Dataset
preferred label: بيانات مسجلة @ar
preferred label: recorded data @en
preferred label: vastgelegde data @nl
related match: http://vocabs.lter-europe.net/elter_cl/10021
preferred label: datos rexistrados @gl
preferred label: dati registrati @it
preferred label: datos registrados @es
alternative label: geregistreerde gegevens @nl
alternative label: zabeleženi podatki @sl
preferred label: aufgezeichnete Daten @de
preferred label: donnée enregistrée @fr
preferred label: записанные данные @ru
preferred label: dados registados @pt
preferred label: καταγεγραμμένα δεδομένα @el
preferred label: dades enregistrades @ca
preferred label: date înregistrate @ro
preferred label: rögzített adatok @hu
preferred label: 기록 데이터 @ko

recenzija
alternative label: revisió entre iguals @ca
preferred label: Gutachten @de
preferred label: akran değerlendirmesi @tr
in scheme: Resource Types
preferred label: avaluació d'experts @ca
preferred label: 同行评议 @zh
preferred label: revisión por pares @es
preferred label: szakmai lektorálás @hu
alternative label: sakkunniggranskning @sv
alternative label: collegiale toetsing @nl
alternative label: naučna ili stručna recenzija
preferred label: ομότιμη αξιολόγηση @el
preferred label: peerreview @nl
alternative label: av aliación por expertos @gl
alternative label: revisió per parells @ca
preferred label: refereegranskning @sv
preferred label: рецензування @uk
alternative label: научна или стручна рецензија
alternative label: hakem değerlendirmesi @tr
alternative label: revisió d'experts @ca
preferred label: évaluation par les pairs @fr
preferred label: vertaisarviointi @fi
preferred label: مراجعة الأقران @ar
broader: приказ
preferred label: evaluare inter pares @ro
preferred label: revisione tra pari @it
preferred label: 査読 @ja
preferred label: peer review @en
preferred label: strokovna ocena @sl
definition: An evaluation of scientific, academic, or professional work by others working in the same field. [Source: Adopted from https://schema.datacite.org/meta/kernel-4.4/doc/DataCite-MetadataKernel_v4.4.pdf] @en
preferred label: рецензија
preferred label: revisão por pares @pt
type: Concept
preferred label: fagfællebedømmelse @da
preferred label: экспертная оценка @ru
alternative label: validation par les pairs @fr
preferred label: 동료심사 @ko

poster sa konferencije
preferred label: 会议集里的会议海报/会议板报 @zh
alternative label: cartel @es
preferred label: póster de congreso @es
broader: zbornik saopštenja sa konferencije
alternative label: poster de conférence @fr
broad match: Event
preferred label: Konferenzposter @de
preferred label: konferensposter @sv
preferred label: conferentieposter @nl
alternative label: konference poster @da
preferred label: pòster de congrés @ca
alternative label: 会议墙报 @zh
preferred label: стендовый доклад @ru
preferred label: póster em conferência @pt
preferred label: постер са конференције
alternative label: 會議牆報 @zh
alternative label: poster de congrès @fr
type: Concept
definition: A display poster, published within a conference proceeding, typically containing text with illustrative figures and/or tables, usually reporting research results or proposing hypotheses, submitted for acceptance to and/or presented at a conference, seminar, symposium, workshop or similar event. [Source: Adapted https://sparontologies.github.io/fabio/current/fabio.html#d4e2648] @en
alternative label: póster em congresso @pt
preferred label: posteri @fi
preferred label: 会議発表ポスター @ja
alternative label: 會議海報 @zh
preferred label: poster de conferinţă @ro
preferred label: poster in congresso @it
preferred label: стендова доповідь @uk
preferred label: conference poster @en
preferred label: poster na konferenci @sl
preferred label: 학술대회 포스터 @ko
alternative label: poster @it
alternative label: poster de congreso @es
alternative label: póster científico @es
preferred label: ملصق مؤتمر @ar
preferred label: konferans posteri @tr
in scheme: Resource Types
preferred label: konference plakat @da
preferred label: poster dans une conférence @fr
alternative label: poster cientifico @es
preferred label: konferencia poszter @hu
preferred label: αφίσα συνεδρίου @el
alternative label: póster @pt

kompilacija podataka
preferred label: gecompileerde data @nl
preferred label: datos compilados @es
broader: скуп података
type: Concept
preferred label: sammanställd data @sv
preferred label: yhdistetty data @fi
preferred label: 컴파일 데이터 @ko
alternative label: بيانات موحدة @ar
preferred label: dados compilados @pt
preferred label: kompilierte Daten @de
in scheme: Resource Types
preferred label: derlenmiş veri @tr
broad match: Dataset
definition: Data collected or assembled from multiple, often heterogeneous sources that have one or more reference points in common, and at least one of the sources was originally produced for other purposes. The data are incorporated in a new entity. For example, providing data on the number of universities in the last 150 years using a variety of available sources (e.g. finance documents, official statistics, university registers), combining survey data with information about geographical areas from official statistics (e.g. population density, doctors per capita, etc.), or using RSS to collect blog posts or tweets, etc. [Source: Adapted from https://ddialliance.org/Specification/DDI-CV/ModeOfCollection_3.0.html] @en
preferred label: компіляція даних @uk
alternative label: компилирани подаци
preferred label: donnée compilée @fr
alternative label: kompilerad data @sv
preferred label: بيانات مجمعة @ar
preferred label: kompilerede data @da
preferred label: dati compilati @it
preferred label: date compilate @ro
preferred label: компилација података
alternative label: date adunate @ro
preferred label: sestavljeni podatki @sl
preferred label: dades compilades @ca
preferred label: 汇编数据 @zh
preferred label: 編集データ @ja
alternative label: kompilirani podaci
preferred label: компилированные данные @ru
alternative label: afledte data @da
preferred label: compiled data @en
preferred label: összegyűjtött adatok @hu

tekst na blogu
definition: A piece of writing or other item of content published on a blog. [Source: https://www.lexico.com/definition/blog_post] @en
preferred label: Blogbeitrag @de
alternative label: post de blogue @pt
alternative label: notícia de blog @ca
preferred label: blog post @en
preferred label: article de blog @fr
alternative label: apunt de blog @ca
preferred label: 博客文章 @zh
preferred label: пост @ru
alternative label: تدوينة مدونة @ar
preferred label: 블로그 기사 @ko
broad match: http://purl.bioontology.org/ontology/MESH/D000069520
preferred label: articolo di blog @it
preferred label: blogginlägg @sv
broader: tekst
editorial note: Published @en
preferred label: blogiteksti @fi
preferred label: articol de blog @ro
preferred label: entrada de blog @gl
alternative label: post de blog @fr
preferred label: blogbejegyzés @hu
alternative label: missatge de blog @ca
preferred label: منشور مدونة @ar
alternative label: billet de blog @fr
broad match: WebContent
broad match: d4e5915
alternative label: postare de blog @ro
preferred label: artigo de blogue @pt
preferred label: Blog yazısı @tr
alternative label: пост в блоге @ru
preferred label: ανάρτηση ιστολογίου @el
preferred label: ブログ記事 @ja
type: Concept
preferred label: допис у блозі @uk
broad match: Blog
preferred label: prispevek na blogu @sl
preferred label: текст на блогу
in scheme: Resource Types
preferred label: blogindlæg @da
alternative label: publicação em blogue @pt

патентна пријава
alternative label: cerere de brevet internaţional @ro
alternative label: solicitude PCT @gl
preferred label: PCT application @en
preferred label: PCT-aanvraag @nl
in scheme: Resource Types
preferred label: Internationale Patentanmeldung @de
preferred label: міжнародна заявка на винахід (РСТ) @uk
preferred label: PCT-ansøgning @da
preferred label: domanda internazionale di brevetto @it
alternative label: tractat de cooperació en materia de patents @ca
preferred label: demande PCT @fr
preferred label: طلب خاص بمعاهدة التعاون بشأن البراءات @ar
preferred label: PCT出願 @ja
preferred label: PCT @gl
preferred label: Заявка РСТ @ru
alternative label: Patent İşbirliği Anlaşması başvurusu @tr
definition: A patent application filed through the WIPO-administered Patent Cooperation Treaty (PCT), also known as an international application. [Source: Adapted from https://www.wipo.int/edocs/pubdocs/en/wipo_pub_943_2018.pdf] @en
preferred label: 国际专利合作条约PCT申请 @zh
broader: patent
preferred label: Pedido PCT @pt
preferred label: PCT-ansökan @sv
preferred label: patentna prijava
preferred label: cerere PCT @ro
preferred label: αίτηση PCT (Συνθήκη συνεργασίας για διπλώματα Ευρεσυτεχνίας) @el
preferred label: kansainvälinen patenttihakemus @fi
alternative label: aplicació del PCT @ca
type: Concept
preferred label: PCT başvurusu @tr
preferred label: PCT bejelentési kérelem @hu
preferred label: PCT 출원 @ko

индустријски дизајн
preferred label: industrieel ontwerp @nl
preferred label: schema industriale @it
definition: Industrial designs are applied to a wide variety of industrial products and handicrafts. They refer to the ornamental or aesthetic aspects of a useful article,including compositions of lines or colors or any three-dimensional forms that give a special appearance to a product or handicraft. [Source: https://www.wipo.int/edocs/pubdocs/en/wipo_pub_943_2018.pdf] @en
preferred label: 工业图纸 @zh
preferred label: 산업디자인 @ko
preferred label: промышленный дизайн @ru
preferred label: deseño industrial @gl
broad match: https://ncicb.nci.nih.gov/ncimbrowser/ConceptReport.jsp
preferred label: промисловий дизайн @uk
alternative label: dessin industriel @fr
broader: дизајн
preferred label: industriel formgivning @da
preferred label: 工業デザイン @ja
preferred label: design industrial @ro
preferred label: disseny industrial @ca
preferred label: ipari formatervezés @hu
preferred label: schéma industriel @fr
preferred label: βιομηχανικό σχέδιο @el
preferred label: industrijsko oblikovanje @sl
in scheme: Resource Types
preferred label: industrial design @en
preferred label: industridesign @sv
preferred label: industrijski dizajn
type: Concept
preferred label: desenho industrial @pt
preferred label: endüstriyel tasarım @tr
preferred label: diseño industrial @es
preferred label: tuotesuunnnitelma @fi
preferred label: تصميم صناعي @ar
preferred label: Industriedesign @de

протокол истраживања
preferred label: research protocol @en
preferred label: протокол исследования @ru
preferred label: протокол дослідження @uk
preferred label: protocole de recherche @fr
alternative label: raziskovalni protokol @sl
preferred label: forskningsprotokol @da
preferred label: tutkimussuunnitelma @fi
preferred label: forskningsprotokoll @sv
alternative label: metodología de investigación @es
preferred label: araştırma protokolü @tr
preferred label: بروتوكول البحث @ar
alternative label: protocolo de pesquisa @pt
preferred label: kutatási protokoll @hu
preferred label: 연구 프로토콜 @ko
broad match: studyregistration
preferred label: 研究プロトコル @ja
alternative label: metodoloxía de investigación @gl
preferred label: protocol de recerca @ca
preferred label: protocolo de investigación @gl
preferred label: 'Forschungsprotokoll' @de
alternative label: metodologia de recerca @ca
preferred label: ερευνητικό πρωτόκολλο @el
preferred label: onderzoeksprotocol @nl
definition: The protocol is a detailed plan of the research study including a project summary, project description covering the rationale, objectives, methodology, data management and analysis, ethical considerations, gender issues and references. [Source: Adapted from https://www.who.int/publications/i/item/a-practical-guide-for-health-researchers] @en
preferred label: protocolo de investigação @pt
preferred label: protocol de cercetare @ro
in scheme: Resource Types
preferred label: protokol istraživanja
broader: извештај
preferred label: 研究方案 @zh
type: Concept
preferred label: protocollo di ricerca @it
preferred label: protokol raziskave @sl

Interview
alternative label: interviu @ca
alternative label: Röportaj @tr
editorial note: Published @en
preferred label: entrevista @ca
narrow match: Text Interview
alternative label: Mülakat @tr
narrow match: interview
top concept of: Resource Types
preferred label: intervista @it
definition: A discussion between a reporter, host, panel, or audience and a newsmaker, author, or celebrity, recorded (edited or unedited) in print, on film or video, as transcript or as a sound recording. (Adapted from ODLIS) @en
preferred label: intervju @sl
preferred label: Görüşme @tr
in scheme: Resource Types
preferred label: interview @nl
type: Concept
narrow match: Broadcast Interview
preferred label: インタビュー @ja
expires: 2021-03-12

podaci prikupljeni posmatranjem
type: Concept
preferred label: observationsdata @sv
preferred label: opazovalni podatki @sl
preferred label: havaintoaineisto @fi
alternative label: datos de observación @gl
preferred label: megfigyelési adatok @hu
editorial note: Data resulting from observational research, which involves collecting observations as they occur (for example, observing behaviors, events, development of condition or disease, etc.), without attempting to manipulate any of the independent variables. [Source: Adapted from https://ddialliance.org/Specification/DDI-CV/ModeOfCollection_3.0.html] @en
in scheme: Resource Types
preferred label: observatiedata @nl
preferred label: данные наблюдений @ru
alternative label: dades d'observació @ca
preferred label: dati osservazionali @it
preferred label: observational data @en
preferred label: date observaționale @ro
preferred label: дані спостереження @uk
preferred label: gözlemsel veri @tr
preferred label: بيانات رصدية @ar
preferred label: Beobachtungsdaten @de
narrow match: http://vocabs.lter-europe.net/elter_cl/10018
preferred label: παρατηρησιακά δεδομένα @el
preferred label: 관측데이터 @ko
preferred label: dades observacionals @ca
preferred label: donnée d'observation @fr
preferred label: datos observacionais @gl
definition: Data resulting from observational research, which involves collecting observations as they occur (for example, observing behaviors, events, development of condition or disease, etc.), without attempting to manipulate any of the independent variables. [Source: Adapted from https://ddialliance.org/Specification/DDI-CV/ModeOfCollection_3.0.html] @en
preferred label: подаци прикупљени посматрањем
preferred label: datos observacionales @es
preferred label: dados observacionais @pt
preferred label: 观测数据 @zh
preferred label: 観測データ @ja
broader: скуп података

уметничко дело
preferred label: Kunstwerk @de
alternative label: criação artística @pt
preferred label: materiale artistico @it
alternative label: художественное произведение @ru
alternative label: umetnički rad
preferred label: твір мистецтва @uk
preferred label: artistic work @en
preferred label: obra artística @gl
preferred label: sanatsal çalışma @tr
preferred label: 艺术作品 @zh
alternative label: trabajo artístico @es
editorial note: New concept included for upcoming version 4.0 @en
alternative label: umetniška stvaritev @sl
alternative label: künstlerische Arbeit @de
preferred label: kunstnerisk værk @da
alternative label: œuvre picturale @fr
alternative label: oggetto d'arte @it
alternative label: traballo artístico @gl
preferred label: 예술작품 @ko
alternative label: lucrare artistică @ro
alternative label: уметнички рад
broad match: CreativeWork
preferred label: konstnärligt arbete @sv
preferred label: umetničko delo
preferred label: trabalho artístico @pt
alternative label: Kunstobjekt @de
top concept of: Resource Types
alternative label: œuvre plastique @fr
alternative label: œuvre d'art @fr
alternative label: treball artístic @ca
preferred label: произведение искусства @ru
preferred label: művészeti alkotás @hu
preferred label: عمل فني @ar
alternative label: umetnina @sl
preferred label: taiteellinen teos @fi
preferred label: 芸術作品 @ja
preferred label: artistiek werk @nl
alternative label: opera d'arte @it
in scheme: Resource Types
preferred label: umetniško delo @sl
preferred label: œuvre artistique @fr
preferred label: activitate artistică @ro
type: Concept
definition: A work of visual arts and performing arts, including musical works; dramatic works; pantomimes and choreographic works; motion picture and other audiovisual works; pictorial, graphic, sculptural and architectural works. Adapted from Law Insider: https://www.lawinsider.com/dictionary/artistic-works @en

новински чланак
preferred label: newspaper article @en
preferred label: Zeitungsartikel @de
preferred label: artículo de periódico @es
preferred label: krantenartikel @nl
preferred label: άρθρο εφημερίδας @el
preferred label: article de journal @fr
editorial note: Published @en
alternative label: Gazete yazısı @tr
alternative label: articulo de periodico @es
preferred label: articolo di giornale @it
broad match: Article
alternative label: article de periòdic @ca
preferred label: artigo de jornal @pt
preferred label: 新聞記事 @ja
broader: novine
preferred label: novinski članak
alternative label: чланак у новинама
preferred label: 报纸文章 @zh
alternative label: članak u novinama
preferred label: artikel i dags-/nyhetstidning @sv
preferred label: avisartikel @da
preferred label: مقال في صحيفة @ar
preferred label: artigo de periódico @gl
in scheme: Resource Types
preferred label: köşe yazısı @tr
type: Concept
preferred label: стаття в газеті @uk
preferred label: članek v časopisu @sl
preferred label: газетная статья @ru
preferred label: article de diari @ca
definition: Work consisting of a news item appearing in a general-interest newspaper or other general news periodical, containing information of current and timely interest in a field. (Adapted from http://www.reference.md/files/D018/mD018431.html ) @en
preferred label: újságcikk @hu
preferred label: articol de ziar @ro
alternative label: articulo de diario @es
alternative label: artículo de diario @es
preferred label: sanomalehtiartikkeli @fi

novine
preferred label: jornal @pt
definition: A non-peer reviewed periodical, usually published daily or weekly, consisting primarily of editorials and news items concerning current or recent events and matters of public interest. [Source: https://sparontologies.github.io/fabio/current/fabio.html#d4e4291] @en
preferred label: газета @uk
preferred label: εφημερίδα @el
preferred label: 新聞 @ja
type: Concept
preferred label: صحيفة @ar
preferred label: ziar @ro
preferred label: gazete @tr
in scheme: Resource Types
preferred label: Zeitung @de
preferred label: journal @fr
preferred label: diari @ca
preferred label: новине
preferred label: újság @hu
preferred label: avis @da
preferred label: časopis @sl
editorial note: Published @en
preferred label: periódico @gl
alternative label: diario @es
alternative label: časnik @sl
broader: tekst
preferred label: sanomalehti @fi
preferred label: tidning @sv
preferred label: 报纸 @zh
preferred label: newspaper @en
preferred label: krant @nl
narrower: новински чланак
preferred label: giornale @it

извештај о истраживању
alternative label: informe de investigacion @es
alternative label: تقرير البحث @ar
preferred label: forskningsrapport @sv
broad match: D058028
preferred label: rapporto di ricerca @it
preferred label: informe de investigación @gl
preferred label: kutatási jelentés @hu
broad match: Report
preferred label: výzkumná zpráva @cs
alternative label: informe cientifico @es
broad match: d4e5170
preferred label: araştırma raporu @tr
preferred label: raport de cercetare @ro
alternative label: 科研報告 @zh
preferred label: تقرير بحثي @ar
preferred label: poročilo o rezultatih raziskav @sl
preferred label: informe de recerca @ca
alternative label: memòria científica @ca
preferred label: research report @en
alternative label: rapport scientifique @fr
alternative label: 研究報告 @zh
type: Concept
preferred label: tutkimusraportti @fi
preferred label: звіт про дослідження @uk
preferred label: 研究报告 @zh
preferred label: Forschungsbericht @de
alternative label: 調研報告 @zh
alternative label: 科研报告 @zh
preferred label: 연구 보고서 @ko
alternative label: informe del resultado de una investigación @es
preferred label: 研究報告書 @ja
broader: извештај
preferred label: informe científico @es
preferred label: исследовательский отчет @ru
in scheme: Resource Types
alternative label: 调研报告 @zh
preferred label: izveštaj o istraživanju
alternative label: memoria científica @es
alternative label: informe científic @ca
alternative label: reporte científico @es
preferred label: rapport de recherche @fr
preferred label: onderzoeksrapport @nl
definition: It is publication that reports on the findings of a research project or alternatively scientific observations on or about a subject. [Source: Adapted from https://en.wikipedia.org/wiki/Research_report] @en
preferred label: ερευνητική έκθεση @el
preferred label: relatório de investigação @pt
alternative label: reporte cientifico @es
alternative label: reporte de investigación @es
editorial note: Published @en

презентација са конференције
alternative label: expunere @ro
preferred label: Konferenzpräsentation @de
preferred label: presentación de congreso @gl
preferred label: konferencia-előadás diasora @hu
preferred label: konferenssiesitelmä @fi
preferred label: prezentare la conferinţă @ro
preferred label: support de présentation à une conférence @fr
preferred label: prezentacija sa konferencije
broader: konferencijski prilog
preferred label: 会議発表資料 @ja
alternative label: presentación @es
preferred label: conferentie presentatie @nl
preferred label: konferenspresentation @sv
definition: A set of slides containing text, tables or figures, designed to communicate ideas or research results, for projection and viewing by an audience at a conference, symposium, seminar, lecture, workshop or other gatherings. [Source: Adapted from hhttps://sparontologies.github.io/fabio/current/fabio.html#d4e4880] @en
alternative label: presentació de conferència @ca
preferred label: konferans sunumu @tr
preferred label: 학술대회 발표자료 @ko
preferred label: конференционная презентация @ru
preferred label: 会议演示报告 @zh
preferred label: παρουσίαση συνεδρίου @el
preferred label: презентація на конференції @uk
preferred label: apresentação em conferência @pt
preferred label: عرض مؤتمر @ar
preferred label: konferencepræsentation @da
alternative label: apresentação @pt
alternative label: presentació de comunicació @ca
type: Concept
in scheme: Resource Types
preferred label: presentazione a convegno @it
preferred label: presentació a congrés @ca
broad match: http://purl.bioontology.org/ontology/SNOMEDCT/246105001
alternative label: prezentare @ro
preferred label: predstavitev na konferenci @sl
preferred label: conference presentation @en

приказ књиге
in scheme: Resource Types
alternative label: recension de libro @es
alternative label: critica de libro @es
preferred label: recensión de libro @gl
preferred label: recenze knihy @cs
alternative label: recensão crítica @pt
alternative label: recension d'ouvrage @fr
preferred label: recenzija knjige @sl
preferred label: recensione di libro @it
preferred label: bokrecension @sv
preferred label: 서평 @ko
preferred label: prikaz knjige
preferred label: note de lecture @fr
preferred label: κριτική βιβλίου @el
preferred label: Buchrezension @de
preferred label: рецензия на книгу @ru
alternative label: نقد كتاب @ar
preferred label: boekbespreking @nl
preferred label: könyvismertetés @hu
alternative label: comentario de libro @es
alternative label: critique de livre @fr
alternative label: ficha de leitura @pt
broader: приказ
alternative label: boek review @nl
preferred label: 书评 @zh
preferred label: kirja-arvostelu @fi
alternative label: Buchbesprechung @de
alternative label: recensió de llibre @ca
definition: A written review and critical analysis of the content, scope and quality of a book or other monographic work. [Source: https://sparontologies.github.io/fabio/current/fabio.html#d4e2300] @en
preferred label: 書評 @ja
preferred label: ressenya de llibre @ca
preferred label: recensão de livro @pt
alternative label: Buchkritik @de
alternative label: crítica de libro @es
preferred label: مراجعة كتاب @ar
alternative label: crítica de llibre @ca
preferred label: kitap eleştirisi @tr
preferred label: boganmeldelse @da
alternative label: resenha de livro @pt
preferred label: reseña de libro @es
type: Concept
preferred label: резензія на книгу @uk
preferred label: book review @en
preferred label: recenzie de carte @ro

симулациони подаци
broad match: Dataset
preferred label: simulatiedata @nl
preferred label: datos de simulación @es
preferred label: данные моделирования @ru
preferred label: بيانات محاكاة @ar
preferred label: dati di simulazione @it
preferred label: προσομοιωμένα δεδομένα @el
preferred label: simuleringsdata @da
preferred label: dados de simulação @pt
preferred label: donnée de simulation @fr
preferred label: simulacijski podatki @sl
alternative label: podaci dobijeni simulacijom
preferred label: シミュレーションデータ @ja
preferred label: szimulációs adatok @hu
preferred label: дані симуляції @uk
preferred label: date de simulare @ro
preferred label: simulation data @en
preferred label: simulaatiolla tuotettu data @fi
definition: Data resulting from modeling or imitative representation of real-world processes, events, or systems, often using computer programs. For example, a program modeling household consumption responses to indirect tax changes; or a dataset on hypothetical patients and their drug exposure, background conditions, and known adverse events. [Source: Adapted from https://ddialliance.org/Specification/DDI-CV/ModeOfCollection_3.0.html] @en
preferred label: simülasyon verisi @tr
preferred label: 模拟数据 @zh
broader: скуп података
type: Concept
preferred label: Simulationsdaten @de
alternative label: simulatiegegevens @nl
preferred label: simulacioni podaci
alternative label: подаци добијени симулацијом
preferred label: dades de simulacions @ca
in scheme: Resource Types

кодирани подаци
broader: скуп података
alternative label: date codificate @ro
preferred label: 编码数据 @zh
preferred label: kodirani podatki @sl
type: Concept
preferred label: datos codificados @gl
preferred label: koodattu data @fi
preferred label: geëncodeerde data @nl
preferred label: kodlanmış veri @tr
preferred label: بيانات مشفرة @ar
preferred label: date criptate @ro
preferred label: kodierte Daten @de
in scheme: Resource Types
preferred label: kodad data @sv
broad match: Dataset
preferred label: 符号化データ @ja
preferred label: кодированные данные @ru
alternative label: donnée codée @fr
preferred label: 부호화 데이터 @ko
preferred label: кодовані дані @uk
preferred label: encoded data @en
definition: Qualitative data (textual, video, audio or still-image) originally produced for other purposes into quantitative data (expressed in unit-by-variable matrices) by using coding techniques in accordance with pre-defined categorization schemes. For example, coded party manifesto data like the "European Parliament Election Study 2009, Manifesto Study" (doi:10.4232/1.10204)". [Source: Adapted from https://ddialliance.org/Specification/DDI-CV/ModeOfCollection_3.0.html] @en
preferred label: donnée encodée @fr
preferred label: kódolt adatok @hu
preferred label: dades codificades @ca
preferred label: dati codificati @it
preferred label: kodede data @da
preferred label: dados codificados @pt
preferred label: kodirani podaci
preferred label: κωδικοποιημένα δεδομένα @el

analiza politike
preferred label: rapport stratégique @fr
definition: A policy report presents what is known about a particular issue or problem. It assembles facts and evidence to help readers understand complex issues and form a response. It might aim to be neutral, or it might aim to persuade readers in a particular direction. [Source: https://www.uow.edu.au/student/learning-co-op/assessments/policy-report/#] @en
alternative label: memoria de protocolo de actuación @es
preferred label: politiikkaraportti @fi
preferred label: informe de situación @gl
alternative label: Strategiepapier @de
preferred label: policy report @en
type: Concept
preferred label: informe de política @ca
preferred label: Policy Report @de
alternative label: informe de gestión @es
alternative label: Grundsatzpapier @de
broader: извештај
preferred label: politika raporu @tr
preferred label: ポリシーレポート @ja
preferred label: تقرير سياسات @ar
preferred label: zpráva k politice nebo strategii @cs
preferred label: informativa politica @it
preferred label: relatório de política @pt
in scheme: Resource Types
preferred label: raport de politică @ro
preferred label: έκθεση πολιτικής @el
preferred label: policyrapport @sv
preferred label: анализа политике
preferred label: звіт з питань політики @uk
preferred label: отчет о политике @ru
alternative label: informe de actuación @es
preferred label: memoria de actuación @es
preferred label: szakpolitikai jelentés @hu
alternative label: informe de gestió @ca
preferred label: 政策报告 @zh
preferred label: politik rapport @da
preferred label: strateško poročilo @sl
alternative label: informe sobre políticas @es
alternative label: 政策報告 @zh
editorial note: Deprecated @en
broad match: Report
preferred label: beleidsrapport @nl

zbornik saopštenja sa konferencije
alternative label: zbornik radova sa konferencije
preferred label: conference proceedings @en
preferred label: actas de congreso @es
alternative label: зборник радова са конференције
alternative label: 컨퍼런스 프로시딩 @ko
preferred label: lucrarile conferinţei @ro
preferred label: Konferenzschrift @de
alternative label: volumele conferinţei @ro
alternative label: llibre de ponències @ca
preferred label: actes de congrés @ca
alternative label: акта конгреса
preferred label: материалы конференций @ru
preferred label: konferenciakötet @hu
preferred label: atti di congresso @it
alternative label: Tagungsband @de
alternative label: akta kongresa
alternative label: konferenshandlingar @sv
preferred label: 학술대회 자료집 @ko
alternative label: 會刊 @zh
alternative label: 会刊 @zh
narrower: poster sa konferencije
preferred label: konferans bildirileri @tr
definition: Conference proceedings is the official record of a conference meeting. It is a collection of documents which corresponds to the presentations given at the conference. It may include additional content. [Source: http://www.ieee.org/documents/confprocdefined.pdf ] @en
broader: konferencijski prilog
alternative label: actas de conferencia @es
preferred label: zbornik prispevkov na konferenci @sl
preferred label: وقائع مؤتمر @ar
alternative label: libro de ponencias @es
alternative label: atas de congresso @pt
narrower: саопштење са конференције
alternative label: actas de conferência @pt
preferred label: πρακτικά συνεδρίου @el
preferred label: зборник саопштења са конференције
alternative label: actes de congrès @fr
preferred label: konferenssijulkaisu @fi
alternative label: actas de congresso @pt
preferred label: actes de conférence @fr
alternative label: 會議論文集 @zh
preferred label: konferensproceeding @sv
preferred label: sborník konference @cs
in scheme: Resource Types
preferred label: матеріали конференції @uk
preferred label: 会議録 @ja
preferred label: atas de conferência @pt
preferred label: konferencehandlinger @da
type: Concept
alternative label: documente din conferinţă @ro
preferred label: 会议论文集 @zh

radni dokument
preferred label: working paper @sv
preferred label: työpaperi @fi
alternative label: çalışma belgesi @tr
preferred label: робочий документ @uk
alternative label: discussion paper @en
alternative label: ورقة قيد العمل @ar
preferred label: çalışma raporu @tr
alternative label: documento de trabalho @pt
preferred label: document de lucru @ro
alternative label: 未發表論文 @zh
alternative label: working or discussion paper @en
preferred label: ورقة عمل @ar
alternative label: prepublicació @ca
alternative label: 未发表论文 @zh
definition: A working or discussion paper circulated publicly or among a group of peers. Certain disciplines, for example economics, issue working papers in series. [Source: http://www.ukoln.ac.uk/repositories/digirep/index/Eprints_Type_Vocabulary_Encoding_Scheme#:~:text=http%3A//purl.org/eprint/type/WorkingPaper] @en
alternative label: arbejdsnotat @da
alternative label: documento de trabalho de investigação @pt
alternative label: papier de travail @fr
preferred label: 研究手稿 @zh
broader: tekst
alternative label: 工作底稿 @zh
preferred label: delovna verzija članka @sl
alternative label: working papers @en
preferred label: рабочий документ @ru
preferred label: arbejdspapir @da
preferred label: ワーキングペーパー @ja
alternative label: préprint @fr
alternative label: werkdocument @nl
alternative label: documento de reflexão @pt
preferred label: έγγραφο εργασίας @el
alternative label: documento di lavoro @it
preferred label: document de travail @fr
alternative label: memorando de investigação @pt
preferred label: радни документ
alternative label: ön makale @tr
preferred label: pracovní dokument @cs
preferred label: documento de traballo @gl
alternative label: borrador de trabajo @es
preferred label: Arbeitspapier @de
type: Concept
preferred label: document de treball @ca
preferred label: műhelytanulmány @hu
preferred label: documento de trabajo @es
broad match: Text
in scheme: Resource Types
preferred label: 워킹페이퍼 @ko

tehnički izveštaj
preferred label: technischer Bericht @de
editorial note: Published @en
preferred label: raport tehnic @ro
preferred label: technická zpráva @cs
preferred label: informe técnico @gl
preferred label: технический отчет @ru
preferred label: műszaki jelentés @hu
alternative label: 技術報告 @zh
preferred label: تقرير فني @ar
preferred label: технічний звіт @uk
preferred label: tekninen raportti @fi
type: Concept
preferred label: テクニカルレポート @ja
alternative label: informe tecnico @es
alternative label: reporte tecnico @es
preferred label: rapporto tecnico @it
preferred label: 技术报告 @zh
preferred label: технички извештај
preferred label: 기술 보고서 @ko
broader: извештај
alternative label: reporte técnico @es
preferred label: technisch rapport @nl
definition: A document that describes the process, progress, or results of technical or scientific research or the state of a technical or scientific research problem. It might also include recommendations and conclusions of the research. [Source: http://guides.library.cornell.edu/ecommons/types] @en
in scheme: Resource Types
preferred label: teknisk rapport @da
preferred label: tehnično poročilo @sl
preferred label: technical report @en
preferred label: informe tècnic @ca
preferred label: teknik rapor @tr
preferred label: relatório técnico @pt
alternative label: تقرير تقني @ar
preferred label: rapport technique @fr
preferred label: τεχνική έκθεση @el

interni izveštaj
preferred label: 内部報告書 @ja
top concept of: Resource Types
preferred label: internal report @en
preferred label: informe interno @es
preferred label: interní zpráva @cs
preferred label: interno poročilo @sl
alternative label: reporte de uso interno @es
preferred label: 内部报告 @zh
in scheme: Resource Types
type: Concept
definition: An internal report is a record of findings collected for internal use. It is not designed to be made public and may include confidential or proprietary information. @en
preferred label: dahili rapor @tr
expires: 2021-03-12
preferred label: rapporto interno @it
alternative label: notranje poročilo @sl
preferred label: intern rapport @nl
alternative label: 內部報告 @zh
preferred label: relatório interno @pt
preferred label: تقرير داخلي @ar
preferred label: informe intern @ca
preferred label: interner Bericht @de
editorial note: Deprecated @en
preferred label: rapport interne @fr
preferred label: интерни извештај

genomski podaci
preferred label: genomiske data @da
preferred label: γονιδιωματικά δεδομένα @el
preferred label: геномные данные @ru
in scheme: Resource Types
preferred label: genomiska data @sv
preferred label: dades genòmiques @ca
preferred label: ゲノムデータ @ja
preferred label: بيانات جينومية @ar
broad match: Dataset
preferred label: dati genomici @it
preferred label: 지놈 데이터 @ko
preferred label: datos genómicos @es
preferred label: Genomdaten @de
preferred label: 基因组数据 @zh
definition: Genomic data refers to the genome and DNA data of an organism. They are used in bioinformatics for collecting, storing and processing the genomes of living things. Genomic data is a more extensive term than sequencing data. However genomic data mostly come from sequencing techniques. It may include non-sequencing data such as data from microarrays, data from real-time PCR panels and data from pharmacogenomics studies. [Source: Adapted from https://www.techopedia.com/definition/31247/genomic-data] @en
preferred label: dados genómicos @pt
preferred label: genomikai adatok @hu
preferred label: геномні дані @uk
preferred label: геномски подаци
preferred label: genomic data @en
preferred label: genomidata @fi
preferred label: date genomice @ro
preferred label: genomische data @nl
preferred label: datos xenómicos @gl
broader: скуп података
type: Concept
preferred label: genomik veri @tr
preferred label: genomski podatki @sl
preferred label: donnée génomique @fr

periodična publikacija
top concept of: Resource Types
alternative label: publication en série @fr
alternative label: publicacion periodica @es
alternative label: časopis @cs
alternative label: pubblicazione periodica @it
type: Concept
preferred label: periodikum @cs
broad match: Text
alternative label: seriale @it
preferred label: publicação periódica @pt
preferred label: periodical @en
preferred label: publicación periódica @es
alternative label: 定期刊物 @zh
alternative label: publicação em série @pt
alternative label: periódico @pt
in scheme: Resource Types
alternative label: 連續出版刊物 @zh
alternative label: publicacion seriada @es
alternative label: периодика
preferred label: serijska publikacija
alternative label: publicació periòdica @ca
preferred label: Periodikum @de
alternative label: publication périodique @fr
expires: 2021-03-12
preferred label: periodico @it
preferred label: periodiek @nl
definition: A periodical is a serial publication with its own distinctive title, characterized by a variety of contents and contributors, and issued at regular intervals. (Adapted from ODLIS) [Source: http://www.abc-clio.com/ODLIS/odlis_p.aspx] @en
preferred label: 逐次刊行物 @ja
alternative label: periodika
alternative label: серијска публикација
preferred label: периодична публикација
preferred label: 期刊 @zh
preferred label: publicació en sèrie @ca
preferred label: périodique @fr
alternative label: publicación seriada @es
preferred label: süreli yayın @tr
alternative label: 连续出版刊物 @zh
alternative label: fortlaufendes Sammelwerk @de
alternative label: publicação seriada @pt

istraživački instrument
preferred label: 연구장비 @ko
preferred label: instrumento de investigação @pt
preferred label: 研究工具 @zh
preferred label: strumentazione @it
alternative label: strumento scientifico @it
preferred label: ερευνητικό εργαλείο @el
top concept of: Resource Types
preferred label: инструмент исследования @ru
editorial note: New concept included for version 4 of resource types Vocab @en
preferred label: instrument de cercetare @ro
preferred label: research instrument @en
preferred label: instrumento de investigación @gl
preferred label: Forschungsinstrument @de
preferred label: araştırma cihazı @tr
alternative label: instrumentación científica @es
preferred label: raziskovalno orodje @sl
type: Concept
preferred label: instrument de recerca @ca
preferred label: forskningsinstrument @da
alternative label: raziskovalni inštrument @sl
alternative label: equipamiento de laboratorio @es
preferred label: instrument de recherche @fr
in scheme: Resource Types
preferred label: 実験装置 @ja
preferred label: истраживачки инструмент
preferred label: інструмент дослідження @uk
preferred label: kutatási eszköz @hu
alternative label: instrumento de pesquisa @pt
preferred label: tutkimusväline @fi
alternative label: equipament de laboratori @ca
preferred label: أداة بحث @ar
definition: A device, tool or apparatus used to obtain, measure and/or analyze data. Source https://datacite-metadata-schema.readthedocs.io/en/4.5/appendices/appendix-1/resourceTypeGeneral/#instrument @en
preferred label: onderzoeksinstrument @nl
alternative label: strumento di ricerca @it
alternative label: instrumentació científica @ca

чланак о рачунарском програму
alternative label: article décrivant un logiciel @fr
preferred label: articol despre software @ro
preferred label: статья по программному обеспечению @ru
preferred label: Softwareartikel @de
editorial note: Published @en
alternative label: opis računarskog programa
alternative label: опис софтвера
preferred label: yazılım makalesi @tr
preferred label: ohjelmistoa kuvaava artikkeli @fi
preferred label: članek o programski opremi @sl
preferred label: software paper @en
alternative label: опис рачунарског програма
preferred label: artigo de software @gl
alternative label: opis softvera
alternative label: article sobre programari @ca
definition: A software paper should include the rationale for the development of the tool and details of the code used for its construction. [Source: Adapted from https://f1000research.com/for-authors/article-guidelines/software-tool-articles ] @en
preferred label: szoftverdokumentáció @hu
preferred label: εργασία λογισμικού @el
preferred label: članak o računarskom programu
alternative label: opis programske opreme @sl
preferred label: descripció de programari @ca
preferred label: software artikel @nl
preferred label: ソフトウェア論文 @ja
type: Concept
preferred label: artículo de software @es
alternative label: 指关于软件设计、开发、应用等方面的学术论文 @zh
preferred label: ورقة برمجيات @ar
preferred label: 软件论文 @zh
broad match: JournalArticle
preferred label: article sur un logiciel @fr
in scheme: Resource Types
preferred label: 소프트웨어 논문 @ko
alternative label: articol despre program @ro
preferred label: стаття - програмне забезпечення @uk
broader: чланак у часопису
alternative label: članak o softveru
alternative label: άρθρο λογισμικού @el
alternative label: чланак о софтверу

članak o skupu podataka
in scheme: Resource Types
preferred label: článek o datové sadě @cs
preferred label: article de dades @ca
preferred label: データ論文 @ja
preferred label: 데이터 논문 @ko
preferred label: adatcikk @hu
alternative label: Forschungsdatenartikel @de
preferred label: data paper @it
alternative label: članek o podatkovnem naboru @sl
preferred label: άρθρο δεδομένων @el
preferred label: artículo de datos @es
preferred label: datadocumentatie @nl
alternative label: 數據文章 @zh
preferred label: veri makalesi @tr
alternative label: articulo de datos cientificos @es
preferred label: artigo de datos @gl
preferred label: 数据文章 @zh
preferred label: članek o podatkovni zbirki @sl
preferred label: статья с цифровыми данными @ru
alternative label: artículo de datos científicos @es
preferred label: artigo de dados @pt
definition: A data paper is a scholarly publication describing a particular dataset or group of dataset, published in the form of a peer-reviewed article in a scholarly journal. The main purpose of a data paper is to describe data, the circumstances of their collection, and information related to data features, access and potential reuse. Adapted from https://en.wikipedia.org/wiki/Data_paper and http://www.gbif.org/publishing-data/data-papers @en
preferred label: Data Paper @de
alternative label: articol de date @ro
alternative label: opis skupa podataka
preferred label: document de date @ro
preferred label: стаття у журналі даних @uk
preferred label: article sur les données @fr
preferred label: tutkimusaineistoa kuvaava artikkeli @fi
preferred label: чланак о скупу података
preferred label: ورقة بيانات @ar
type: Concept
alternative label: опис скупа података
alternative label: data descriptor @en
broader: чланак у часопису
alternative label: articulo de datos @es

агрегирани подаци
preferred label: aggregoitu tilastotieto @fi
preferred label: toplanmış veri @tr
preferred label: 聚合数据 @zh
broader: скуп података
type: Concept
alternative label: združeni podatki @sl
preferred label: dados agregados @pt
broad match: https://vocabs.lter-europe.net/elter_cl/en/page/10016
in scheme: Resource Types
preferred label: aggregierte Daten @de
preferred label: συγκεντρωτικά δεδομένα @el
preferred label: بيانات مدمجة @ar
preferred label: 集計データ @ja
preferred label: datos agregados @gl
preferred label: aggregált adatok @hu
broad match: Dataset
preferred label: aggregerade data @sv
preferred label: agregirani podaci
preferred label: агреговані дані @uk
preferred label: date agregate @ro
preferred label: aggregated data @en
preferred label: dati aggregati @it
alternative label: date cumulate @ro
preferred label: 집계 데이터 @ko
preferred label: dades agregades @ca
preferred label: données agrégées @fr
definition: Statistics that relate to broad classes, groups, or categories. The data are averaged, totaled, or otherwise derived from individual-level data, and it is no longer possible to distinguish the characteristics of individuals within those classes, groups, or categories. For example, the number and age group of the unemployed in specific geographic regions, or national level statistics on the occurrence of specific offences, originally derived from the statistics of individual police districts. [Source: https://ddialliance.org/Specification/DDI-CV/ModeOfCollection_3.0.html] @en
alternative label: بيانات تلخيصية @ar
preferred label: geaggregeerde data @nl
alternative label: izpeljani podatki @sl
preferred label: agregirani podatki @sl
preferred label: aggregerede data @da
preferred label: агрегированные данные @ru

informativni prilog
preferred label: contribution to journal @en
alternative label: 期刊文獻 @zh
alternative label: artículo de boletín @es
alternative label: articulo de prensa @es
in scheme: Resource Types
alternative label: информативни прилог (у часопису)
alternative label: artículo de prensa @es
preferred label: contribution à un journal @fr
preferred label: tijdschrift bijdrage @nl
definition: A contribution to a journal denotes a work published in a journal. If applicable sub-terms should be chosen. @en
preferred label: مساهمة في دورية @ar
alternative label: artículo de revista @es
expires: 2021-03-12
preferred label: 学術雑誌掲載記事 @ja
preferred label: contributo in rivista @it
alternative label: 期刊论文 @zh
preferred label: contributo em revista @pt
alternative label: informativni prilog (u časopisu)
alternative label: articulo de revista @es
alternative label: مقال في دورية @ar
preferred label: prispevek v reviji @sl
preferred label: contribución a revista @es
preferred label: информативни прилог
preferred label: contribució a revista @ca
preferred label: příspěvek v časopisu @cs
top concept of: Resource Types
preferred label: 期刊文献 @zh
preferred label: Zeitschriftenbeitrag @de
type: Concept

експериментални подаци
preferred label: datos experimentais @gl
preferred label: experimental data @en
preferred label: eksperimentalni podatki @sl
preferred label: dados experimentais @pt
preferred label: kokeellinen data @fi
preferred label: 실험 데이터 @ko
preferred label: eksperimentalni podaci
broader: скуп података
preferred label: experimentele data @nl
preferred label: dati sperimentali @it
preferred label: date experimentale @ro
definition: Data resulting from the experimental research method involving the manipulation of some or all of the independent variables included in the hypotheses. [Source: Adapted from https://ddialliance.org/Specification/DDI-CV/ModeOfCollection_3.0.html] @en
preferred label: kísérleti adatok @hu
preferred label: eksperimentelle data @da
preferred label: experimentella data @sv
preferred label: deneysel veri @tr
type: Concept
preferred label: 実験データ @ja
preferred label: πειραματικά δεδομένα @el
in scheme: Resource Types
preferred label: dades experimentals @ca
preferred label: експериментальні дані @uk
broad match: Dataset
preferred label: experimentelle Daten @de
preferred label: 实验数据 @zh
preferred label: donnée expérimentale @fr
preferred label: بيانات تجريبية @ar
preferred label: экспериментальные данные @ru
preferred label: datos experimentales @es

konferencijski prilog
narrower: zbornik saopštenja sa konferencije
preferred label: materiale de conferință @ro
preferred label: 会议对象 @zh
alternative label: نتاج مؤتمر @ar
preferred label: 회의자료 @ko
preferred label: risultato di convegno @it
preferred label: матеріал конференції @uk
narrower: neobjavljen poster sa konferencije
in scheme: Resource Types
preferred label: contribució a congrés @ca
definition: All kind of digital resources contributed to a conference, like conference presentation (slides), conference report, conference lecture, abstracts, demonstrations. For conference papers, posters or proceedings the specific sub-concepts should be used. [COAR definition] @en
preferred label: documento de conferência @pt
preferred label: objet présenté à une conférence @fr
preferred label: conference output @en
narrower: neobjavljeno saopštenje sa konferencije
preferred label: konferensbidrag @sv
preferred label: επιστημονική παραγωγή συνεδρίου @el
preferred label: конференцијски прилог
preferred label: konferans çıktısı @tr
broad match: Event
preferred label: conferentie bijdrage @nl
preferred label: rezultat na konferenci @sl
preferred label: Konferenzveröffentlichung @de
broader: tekst
preferred label: konferencia anyagok @hu
alternative label: materiale din conferință @ro
preferred label: contribución de congreso @es
alternative label: materiale folosite la conferință @ro
preferred label: конференц-объект @ru
preferred label: contribución a congreso @gl
preferred label: 会議資料 @ja
type: Concept
preferred label: مخرج مؤتمر @ar
narrower: презентација са конференције

interaktivna građa
preferred label: 인터렉티브 리소스 @ko
preferred label: مصدر تفاعلي @ar
preferred label: interaktivt materiale @da
alternative label: 互動資源 @zh
preferred label: 互动资源 @zh
preferred label: recurso interactivo @es
preferred label: interaktív forrás @hu
alternative label: 交互式資源 @zh
type: Concept
narrower: veb-sajt
preferred label: recurs interactiu @ca
alternative label: interaktiv ressource @da
in scheme: Resource Types
alternative label: contributo a convegno @it
preferred label: інтерактивний ресурс @uk
alternative label: 交互式资源 @zh
preferred label: interactieve bron @nl
preferred label: etkileşimli kaynak @tr
preferred label: interaktiivinen resurssi @fi
preferred label: recurso interativo @pt
preferred label: interaktivní zdroj @cs
preferred label: risorsa interattiva @it
preferred label: интерактивна грађа
preferred label: interaktive Ressource @de
alternative label: مورد تفاعلي @ar
preferred label: interaktiv resurs @sv
alternative label: интерактивни ресурс
definition: A resource requiring interaction from the user to be understood, executed, or experienced. Examples include forms on Web pages, applets, multimedia learning objects, chat services, or virtual reality environments. Source: http://purl.org/dc/dcmitype/InteractiveResource @en
preferred label: interactive resource @en
top concept of: Resource Types
preferred label: ressource interactive @fr
preferred label: インタラクティブリソース @ja
preferred label: resursă interactivă @ro
alternative label: interaktivni vir @sl
preferred label: интерактивный ресурс @ru
alternative label: interaktivni resurs

систем организације знања
type: Concept
preferred label: 지식조직체계 @ko
preferred label: sistema para la organización del conocimiento @es
preferred label: σύστημα οργάνωσης γνώσης @el
top concept of: Resource Types
preferred label: sistema de organização do conhecimento @pt
preferred label: kennissysteem @nl
narrow match: d4e5645
narrow match: https://bioportal.bioontology.org/ontologies/MESH
alternative label: sistema para a organización do coñecemento @gl
preferred label: система организации знаний @ru
in scheme: Resource Types
preferred label: vidensorganisationssystem @da
preferred label: نظام تنظيم المعرفة @ar
preferred label: система організації знання @uk
preferred label: sistema di organizzazione della conoscenza @it
preferred label: bilgi organizasyon sistemi @tr
preferred label: kunskapsorganisationssystem @sv
preferred label: sistema d'organització del coneixement @ca
preferred label: sistem za organizacijo znanja @sl
alternative label: système d'organisation de la connaissance @fr
definition: All types of schemes for organizing information and promoting knowledge management. Knowledge organization systems include classification schemes that organize materials at a general level (such as books on a shelf), subject headings that provide more detailed access, and authority files that control variant versions of key information (such as geographic names and personal names). They also include less-traditional schemes, such as semantic artifacts, semantic networks and ontologies. https://www.clir.org/pubs/reports/pub91/1knowledge/ @en
editorial note: New concept included for upcoming version 4.0 @en
preferred label: sistem organizacije znanja
preferred label: tudásszervezési rendszerek @hu
preferred label: tiedonhallintajärjestelmä @fi
preferred label: système d'organisation des connaissances @fr
narrow match: d4e5828
alternative label: sistema de organización del conocimiento @es
narrow match: controlledVocabulary
alternative label: sistema organizzativo del sapere @it
preferred label: 知識組織化体系 @ja
narrow match: d4e5735
preferred label: sistema de organización do coñecemento @gl
preferred label: sistem de organizare a cunoștinței @ro
preferred label: Wissensorganisationssystem @de
preferred label: knowledge organization system @en

наставни материјал
preferred label: obiect de învăţare @ro
alternative label: Lernunterlagen @de
preferred label: Öğrenim nesnesi @tr
editorial note: Published @en
preferred label: oggetto didattico @it
alternative label: Kursmaterial @de
preferred label: 教材 @ja
preferred label: oppimateriaali @fi
preferred label: lärobjekt @sv
preferred label: object d'apprentissage @fr
preferred label: objeto de aprendizaje @es
preferred label: 교수학습자료 @ko
type: Concept
preferred label: leerobject @nl
preferred label: Lernobjekt @de
alternative label: مادة تعليمية @ar
top concept of: Resource Types
preferred label: كائن تعليمي @ar
preferred label: učno gradivo @sl
definition: A digital resource that can be reused to enhance teaching and learning. Source https://icas-ca.org/archive/projects/coerc/oer-glossary/ @en
preferred label: obxecto de aprendizaxe @gl
preferred label: навчальний об'єкт @uk
preferred label: Objeto de aprendizagem @pt
alternative label: odprti učni vir @sl
in scheme: Resource Types
preferred label: объект обучения @ru
preferred label: læringsobjekt @da
alternative label: وحدة تعليمية @ar
broad match: InteractiveResource
preferred label: objecte d’aprenentatge @ca
preferred label: tanulást támogató digitális eszköz @hu
alternative label: obiect de învăţământ @ro
preferred label: nastavni materijal
preferred label: learning object @en

слика
preferred label: obraz @cs
preferred label: immagine @it
preferred label: зображення @uk
preferred label: изображение @ru
preferred label: 이미지 @ko
preferred label: kép @hu
preferred label: imagine @ro
narrower: покретне слике
preferred label: billede @da
preferred label: kuva @fi
alternative label: 影像 @zh
preferred label: εικόνα @el
top concept of: Resource Types
preferred label: slika
type: Concept
preferred label: イメージ @ja
alternative label: vizuelni prikaz
preferred label: image @en
broad match: MediaObject
alternative label: figura @ca
alternative label: vizualna upodobitev @sl
alternative label: 圖像 @zh
narrower: статична слика
preferred label: görsel @tr
definition: A visual representation other than text, including all types of moving image and still image. [Source: Adapted from http://purl.org/dc/dcmitype/Image] @en
alternative label: 图片 @zh
preferred label: bild @sv
alternative label: 圖片 @zh
in scheme: Resource Types
preferred label: 图像 @zh
preferred label: imagem @pt
narrow match: StillImage
alternative label: imaj @tr
preferred label: imaxe @gl
preferred label: afbeelding @nl
alternative label: poză @ro
alternative label: fotografie @ro
alternative label: визуелни приказ
alternative label: beeldmateriaal @nl
preferred label: imatge @ca
preferred label: imagen @es
preferred label: صورة @ar
preferred label: Bild @de

patentirana sorta
preferred label: patente de plantas @gl
broad match: d4e4551
type: Concept
preferred label: 식물 특허 @ko
preferred label: kwekersrecht @nl
preferred label: rastlinska sorta @sl
preferred label: 品种专属权 @zh
preferred label: kasvinjalostepatentti @fi
preferred label: 植物特許 @ja
alternative label: brevet végétal @fr
preferred label: bitki patenti @tr
in scheme: Resource Types
preferred label: патент на растение @ru
broad match: C43358
preferred label: brevet de plante @fr
preferred label: πατέντα φυτών @el
preferred label: plant patent @en
preferred label: brevetto di pianta @it
preferred label: brevet pentru plantă @ro
preferred label: växtpatent @sv
preferred label: patent de plantes @ca
preferred label: növényszabadalom @hu
preferred label: براءة اختراع نبات @ar
preferred label: plante patent @da
definition: A patent granted to anyone who has invented or discovered and asexually reproduced any distinct and new variety of plant, including cultivated sports, mutants, hybrids, and newly found seedlings, other than a tuber-propagated plant or a plant found in an uncultivated state. [Source: Adapted from https://www.uspto.gov/patents/basics/types-patent-applications/general-information-about-35-usc-161#heading-1] @en
alternative label: биљни патент
preferred label: Pflanzenpatent @de
preferred label: патентирана биљна сорта
preferred label: патент на сорт рослин @uk
broader: patent
alternative label: brevet pentru soi @ro

Testcoll
type: Collection
preferred label: Testcoll-de @de

research data
in scheme: Resource Types
definition: Data that are used as primary sources to support technical or scientific enquiry, research, scholarship, or artistic activity, and that are used as evidence in the research process and/or are commonly accepted in the research community as necessary to validate research findings and results. [Source: https://casrai.org/term/research-data] @en
top concept of: Resource Types
expires: 2021-04-01
type: Concept

ostale periodične publikacije
preferred label: muu kausijulkaisu @fi
preferred label: altro periodico @it
type: Concept
preferred label: autre périodique @fr
preferred label: 其他连续出版物 @zh
alternative label: ostala periodika
in scheme: Resource Types
preferred label: その他の逐次刊行物 @ja
preferred label: ostale serijske publikacije @sl
preferred label: otras publicaciones periódicas @es
preferred label: other periodical @en
preferred label: periodieke uitgave @nl
preferred label: altre publicació periòdica @ca
preferred label: другое периодическое издание @ru
preferred label: diğer süreli yayınlar @tr
definition: A resource type that is not included in existing terms under the top concept "Text". [COAR definition] @en
broader: tekst
alternative label: остала периодика
alternative label: altre publicació en sèrie @ca
alternative label: anders @nl
preferred label: остале периодичне публикације

писмо
type: Concept
preferred label: dopis @cs
preferred label: Brief @de
preferred label: مراسلة @ar
preferred label: lettre @fr
alternative label: missiva @pt
preferred label: carta @es
preferred label: levél @hu
preferred label: comunicazione @it
preferred label: kirje @fi
alternative label: polemika @sl
preferred label: brev @sv
alternative label: Leserbrief @de
alternative label: Korrespondenz @de
broad match: Text
narrow match: D019531
preferred label: pismo
preferred label: scrisoare @ro
preferred label: 편지 @ko
preferred label: letter @en
in scheme: Resource Types
preferred label: 信 @zh
preferred label: 短報 @ja
alternative label: 读者来信 @zh
preferred label: brief @nl
definition: A brief description of important new research, also known as “communication”. [Source: https://cerif.eurocris.org/vocab/html/OutputTypes.html#Letter] @en
alternative label: lettera @it
preferred label: лист @uk
alternative label: 讀者來信 @zh
preferred label: письмо @ru
alternative label: dikusijski prispevek @sl
preferred label: mektup @tr
preferred label: επιστολή @el
broader: tekst